{"text_format":"3","workbook":"xlsx","n_sheets":14,"sheets":["入力シート","新設","撤去","部修","旧裏面資料","動作ログ","改定履歴","コード変換","関連項目チェック一覧","単項目チェック一覧","単結図","平面図","マスタデータ1","マスタデータ2"],"not_rendered":{"macros":1,"external_links":1,"defined_names":123,"comments":3},"read":"whole","date_system":"1900"}

{"sheet":"入力シート","index":0,"n_rows":44,"n_cols":23,"rows_kept":44,"merged":[[0,0,1,21],[3,1,3,16],[4,1,4,16],[5,1,5,16],[7,6,7,8],[12,1,12,16],[14,1,14,16],[18,1,18,6],[18,8,18,9],[18,10,18,11],[18,12,18,13],[18,14,18,15],[18,16,18,17],[18,18,18,19],[20,1,20,2],[20,3,20,4],[20,5,20,6],[20,7,20,8],[20,9,20,10],[20,11,20,12],[20,15,20,16],[21,15,21,16],[23,1,23,2],[23,3,23,4],[23,5,23,6],[23,8,23,9],[23,10,23,11],[23,12,23,13],[25,1,25,3],[26,1,26,3],[26,8,26,9],[26,10,26,13],[26,14,26,15],[26,17,27,18],[26,20,26,21],[27,1,27,3],[27,10,27,13],[27,14,27,15],[27,20,27,21],[29,0,36,0],[29,1,32,1],[29,2,32,2],[29,3,32,3],[29,4,29,12],[29,13,32,13],[29,14,32,16],[30,4,32,4],[30,5,30,6],[30,7,32,7],[30,8,32,8],[30,9,32,9],[30,10,32,10],[30,11,32,12],[31,6,32,6],[38,0,43,0],[38,1,41,1],[38,2,41,2],[38,3,39,6],[38,7,41,11],[38,12,41,14],[38,15,38,18],[38,19,41,19],[38,20,41,20],[38,21,41,21],[38,22,41,22],[39,15,41,15],[39,16,41,16],[39,17,41,17],[39,18,41,18],[40,3,41,4],[40,5,41,6]]}
["臨時引込線工事設計書  入力シート  Ver2.04"]
[]
[]
["需要場所住所",{"$nulls":16},"必須","【手入力】"]
["目標",{"$nulls":16},"入力不要"]
["契約者名",{"$nulls":16},"必須","【手入力】"]
[]
["事業所情報","支店",null,"営業支店","営業所","グループ","営業所"]
[null,null,"-",{"$nulls":5},0,"必須","【選択および手入力】"]
[]
["工事会社CD",null,null,"-",{"$nulls":3},"必須","【手入力】"]
[]
["工事会社名",{"$nulls":16},"必須","【手入力】"]
[]
["工事設計者",{"$nulls":16},"必須","【手入力】"]
[]
["設計書No",{"$nulls":3},"必須","【手入力】"]
[]
["引込柱",{"$nulls":7},"画",null,"区",null,"図",null,"番",null,"の",null,"号"]
[null,"必須【12桁連続手入力】",{"$nulls":6},{"$f":"IF(LEN(B19)=12,LEFT(B19,1),\"\")","v":""},{"$f":"IF(LEN(B19)=12,MID(B19,2,1),\"\")","v":""},{"$f":"IF(LEN(B19)=12,MID(B19,3,1),\"\")","v":""},{"$f":"IF(LEN(B19)=12,MID(B19,4,1),\"\")","v":""},{"$f":"IF(LEN(B19)=12,MID(B19,5,1),\"\")","v":""},{"$f":"IF(LEN(B19)=12,MID(B19,6,1),\"\")","v":""},{"$f":"IF(LEN(B19)=12,MID(B19,7,1),\"\")","v":""},{"$f":"IF(LEN(B19)=12,MID(B19,8,1),\"\")","v":""},{"$f":"IF(LEN(B19)=12,MID(B19,9,1),\"\")","v":""},{"$f":"IF(LEN(B19)=12,MID(B19,10,1),\"\")","v":""},{"$f":"IF(LEN(B19)=12,MID(B19,11,1),\"\")","v":""},{"$f":"IF(LEN(B19)=12,RIGHT(B19,1),\"\")","v":""}]
["変圧器柱","画",null,"区",null,"図",null,"番",null,"の",null,"号",{"$nulls":3},"変圧器容量"]
[{"$nulls":13},"入力不要",{"$nulls":3},"入力不要"]
[]
["申込情報","電灯",{"$nulls":3},"A",null,null,"電力",{"$nulls":3},"KW",null,"灯力いずれか入力 必須【手入力】"]
[{"$nulls":4},"容量",null,"単位",{"$nulls":4},"容量",null,"単位",null,null,"※灯は単位も入力"]
["カード枚数","原票区分3"]
[null,"カード枚数",{"$nulls":6},"施工情報",null,"道路横断",{"$nulls":5},"必須","径間長\n[m]",null,"単独",null,null,"必須"]
[{"$nulls":4},"必須【手入力】",{"$nulls":5},"道路上地上高[m]",{"$nulls":8},"連接"]
[{"$nulls":18},"※余長を含まない長さを入力"]
["原票区分3","カード№","訂　正","付　外","引　込　線",{"$nulls":8},"設計工量","供給\nKW\n（100W）"]
[{"$nulls":4},"灯　力","パターン",null,"条　数","電話防護","太　さ","口　数","総亘長"]
[{"$nulls":5},"方式","線種"]
[{"$nulls":5},1]
[null,14,26,27,28,29,31,32,33,34,35,36,37,38,39,40,41]
[null,{"$f":"IF(B28>=1,\"1\",\"\")","v":""},{"$f":"IF(B35=\"1\",\"　\",\"\")","v":""}]
[null,{"$f":"IF(B28>=2,\"2\",\"\")","v":""},{"$f":"IF(B36=\"2\",\"　\",\"\")","v":""}]
[null,{"$f":"IF(B28>=3,\"3\",\"\")","v":""},{"$f":"IF(B37=\"3\",\"　\",\"\")","v":""}]
[]
["原票区分4","カード№","訂　正","撤去予定",{"$nulls":3},"営業受付No",{"$nulls":4},"撤去設計No",null,null,"引込アーム",{"$nulls":3},"（廃止）","HS防護","その他割","違反件数"]
[{"$nulls":15},"本柱材","種別","長さ","タイ"]
[{"$nulls":3},"月",null,"日"]
[]
[null,14,16,18,19,20,21,22,23,24,25,26,27,28,29,40,41,42,43,44,45,47,48]
[null,{"$f":"IF(B28<>\"\",B28+1,\"\")","v":""},{"$f":"IF(B44<>\"\",\"　\",\"\")","v":""}]

{"sheet":"新設","index":1,"n_rows":55,"n_cols":60,"rows_kept":55,"merged":[[0,11,1,38],[0,48,0,51],[0,52,0,55],[0,56,0,59],[1,48,3,51],[1,52,3,55],[1,56,3,59],[2,0,2,3],[2,4,3,20],[2,21,2,22],[2,23,3,45],[4,0,5,3],[4,4,4,5],[4,6,5,9],[4,13,4,14],[4,15,5,18],[4,21,5,21],[4,22,4,24],[4,25,5,34],[4,35,4,37],[4,38,5,45],[5,22,5,24],[7,9,7,12],[7,13,10,18],[7,19,10,21],[7,22,10,22],[7,23,10,23],[7,24,7,32],[7,33,10,33],[7,34,10,34],[7,35,10,35],[7,36,7,45],[7,46,10,46],[7,47,10,49],[7,50,8,55],[7,56,10,56],[7,57,11,59],[8,9,10,9],[8,10,10,10],[8,11,10,11],[8,12,10,12],[8,24,10,26],[8,27,8,32],[8,36,10,36],[8,37,8,39],[8,40,10,40],[8,41,10,41],[8,42,10,42],[8,43,10,43],[8,44,10,45],[9,27,10,28],[9,29,10,30],[9,31,10,32],[9,37,9,38],[9,39,10,39],[9,50,10,51],[9,52,10,53],[9,54,10,55],[12,9,13,9],[12,10,13,10],[12,11,13,11],[12,12,13,12],[12,13,13,13],[12,14,13,14],[12,15,13,15],[12,16,13,16],[12,17,13,17],[12,18,13,18],[12,19,13,19],[12,20,13,20],[12,21,13,21],[12,22,13,22],[12,23,13,23],[12,24,13,24],[12,25,13,25],[12,26,13,26],[12,27,13,27],[12,28,13,28],[12,29,13,29],[12,30,13,30],[12,31,13,31],[12,32,13,32],[12,33,13,33],[12,34,13,34],[12,35,13,35],[12,36,13,36],[12,37,13,37],[12,38,13,38],[12,39,13,39],[12,40,13,40],[12,41,13,41],[12,42,13,42],[12,43,13,43],[12,44,13,44],[12,45,13,45],[12,46,13,46],[12,47,13,47],[12,48,13,48],[12,49,13,49],[12,50,13,50],[12,51,13,51],[12,52,13,52],[12,53,13,53],[12,54,13,54],[12,55,13,55],[12,56,13,56],[14,0,15,4],[14,22,15,22],[14,23,15,23],[14,24,15,32],[14,33,15,33],[14,34,15,34],[14,35,15,35],[14,36,15,36],[14,37,15,37],[14,38,15,38],[14,39,15,39],[14,40,15,40],[14,41,15,41],[14,42,15,42],[14,43,15,43],[14,44,15,44],[14,45,15,45],[14,46,15,46],[14,47,15,49],[14,50,15,55],[14,56,15,56],[16,22,17,22],[16,23,17,23],[16,24,17,32],[16,33,17,33],[16,34,17,34],[16,35,17,35],[16,36,17,36],[16,37,17,37],[16,38,17,38],[16,39,17,39],[16,40,17,40],[16,41,17,41],[16,42,17,42],[16,43,17,43],[16,44,17,44],[16,45,17,45],[16,46,17,46],[16,47,17,49],[16,50,17,55],[16,56,17,56],[18,47,18,56],[20,22,23,22],[20,23,23,23],[20,24,23,24],[20,25,23,25],[20,26,21,29],[20,30,23,34],[20,35,23,37],[20,38,23,47],[20,48,20,51],[20,52,23,52],[20,53,23,53],[20,54,23,54],[20,55,23,55],[20,56,23,56],[20,57,24,59],[21,48,23,48],[21,49,23,49],[21,50,23,50],[21,51,23,51],[22,26,23,27],[22,28,23,29],[25,22,26,22],[25,23,26,23],[25,24,26,24],[25,25,26,25],[25,26,26,26],[25,27,26,27],[25,28,26,28],[25,29,26,29],[25,30,26,30],[25,31,26,31],[25,32,26,32],[25,33,26,33],[25,34,26,34],[25,35,26,35],[25,36,26,36],[25,37,26,37],[25,38,26,38],[25,39,26,39],[25,40,26,40],[25,41,26,41],[25,42,26,42],[25,43,26,43],[25,44,26,44],[25,45,26,45],[25,46,26,46],[25,47,26,47],[25,48,26,48],[25,49,26,49],[25,50,26,50],[25,51,26,51],[25,52,26,52],[25,53,26,53],[25,54,26,54],[25,55,26,55],[25,56,26,56],[27,26,27,34],[27,35,27,37],[27,44,29,49],[27,50,29,59],[30,44,32,49],[31,51,32,53],[31,56,32,58],[33,44,35,47],[33,48,35,48],[33,49,35,52],[33,53,35,53],[33,54,35,54],[33,55,35,58],[33,59,35,59],[36,40,36,45],[36,46,37,47],[36,48,37,53],[36,54,37,55],[36,56,37,58],[36,59,37,59],[37,40,37,45],[38,41,38,58],[39,41,39,58],[40,41,40,58],[41,29,41,39],[41,41,41,58],[42,29,42,31],[42,32,43,39],[42,41,42,58],[43,29,43,31],[43,41,43,58],[44,29,44,31],[44,32,45,39],[44,41,44,58],[45,29,45,31],[45,41,45,58]]}
["ver2.04(2021.9)",{"$nulls":10},"　臨時引込線工事設計書（新設）",{"$nulls":36},"上長",{"$nulls":3},"検収担当",{"$nulls":3},"設計照査"]
[{"$f":"IF(入力シート!N11<>\"\",\"NW受付番号：\" & 入力シート!N11,\"NW受付番号：\")","v":"NW受付番号："}]
["お客さま名",{"$nulls":3},{"$f":"IF(入力シート!B6<>\"\",入力シート!B6,\"\")","v":""},{"$nulls":16},"住所",null,{"$f":"IF(入力シート!B4<>\"\",入力シート!B4,\"\")","v":""}]
[]
["申し込み\n内容",{"$nulls":3},"電灯",null,{"$f":"IF(入力シート!D24<>\"\",入力シート!D24,\"\")","v":""},{"$nulls":6},"電力",null,{"$f":"IF(入力シート!K24<>\"\",入力シート!K24,\"\")","v":""},{"$nulls":5},"設計","工事",null,null,{"$f":"IF(入力シート!B13<>\"\",入力シート!B13,\"\")","v":""},{"$nulls":9},"担当者",null,null,{"$f":"IF(入力シート!B15<>\"\",入力シート!B15,\"\")","v":""}]
[{"$nulls":12},{"$f":"IF(入力シート!F24<>\"\",入力シート!F24,\"\")","v":"A"},{"$nulls":7},"kW",null,"会社名"]
[]
[{"$nulls":9},"事業所",{"$nulls":3},"工事会社",{"$nulls":5},"設計書No",null,null,"カード№","原票区分",{"$nulls":9},"工事区分","訂　正","付　外","引　込　線",{"$nulls":9},"設計工量","供給\nKW\n(100W)",null,null,"引込柱No",{"$nulls":6},"インプット\n\nチェック"]
[{"$nulls":9},"支店","営業支店","営業所","グループ",{"$nulls":11},"営業所",null,null,"メッシュNo",{"$nulls":8},"灯　力","パターン",null,null,"条　数","電話防護","太　さ","口　数","総亘長"]
[{"$nulls":27},"画",null,"区",null,"図",{"$nulls":5},"方式",null,"線種",{"$nulls":10},"番",null,"の",null,"号"]
[{"$nulls":37},1,2]
[{"$nulls":9},1,2,3,4,5,6,7,8,9,10,11,12,13,14,15,16,17,18,19,20,21,22,23,24,25,26,27,28,29,30,31,32,33,34,35,36,37,38,39,40,41,42,43,44,45,46,47,48]
[{"$nulls":9},{"$f":"IF(入力シート!B9<>\"\",入力シート!B9,\"\")","v":""},{"$f":"IF(入力シート!D9<>\"\",入力シート!D9,\"\")","v":""},{"$f":"IF(入力シート!E9<>\"\",入力シート!E9,\"\")","v":""},{"$f":"IF(入力シート!F9<>\"\",入力シート!F9,\"\")","v":""},{"$f":"IF(入力シート!B11<>\"\",入力シート!B11,\"\")","v":""},{"$f":"IF(入力シート!C11<>\"\",入力シート!C11,\"\")","v":""},"-",{"$f":"IF(入力シート!E11<>\"\",入力シート!E11,\"\")","v":""},{"$f":"IF(入力シート!F11<>\"\",入力シート!F11,\"\")","v":""},{"$f":"IF(入力シート!G11<>\"\",入力シート!G11,\"\")","v":""},{"$f":"IF(入力シート!B17<>\"\",入力シート!B17,\"\")","v":""},{"$f":"IF(入力シート!C17<>\"\",入力シート!C17,\"\")","v":""},{"$f":"IF(入力シート!D17<>\"\",入力シート!D17,\"\")","v":""},{"$f":"IF(入力シート!B35<>\"\",入力シート!B35,\"\")","v":""},3,{"$f":"IF(入力シート!G9<>\"\",入力シート!G9,\"\")","v":""},{"$f":"IF(入力シート!H9<>\"\",入力シート!H9,\"\")","v":""},0,{"$f":"IF(入力シート!I20<>\"\",入力シート!I20,\"\")","v":""},{"$f":"IF(入力シート!J20<>\"\",入力シート!J20,\"\")","v":""},{"$f":"IF(入力シート!K20<>\"\",入力シート!K20,\"\")","v":""},{"$f":"IF(入力シート!L20<>\"\",入力シート!L20,\"\")","v":""},{"$f":"IF(入力シート!M20<>\"\",入力シート!M20,\"\")","v":""},{"$f":"IF(入力シート!N20<>\"\",入力シート!N20,\"\")","v":""},2,{"$f":"IF(AND(入力シート!$B35<>\"\",入力シート!C35<>\"\"),入力シート!C35,\"\")","v":""},{"$f":"IF(AND(入力シート!$B35<>\"\",入力シート!D35<>\"\"),入力シート!D35,\"\")","v":""},{"$f":"IF(AND(入力シート!$B35<>\"\",入力シート!E35<>\"\"),入力シート!E35,\"\")","v":""},{"$f":"IF(AND(入力シート!$B35<>\"\",入力シート!F35<>\"\"),入力シート!F35,\"\")","v":""},null,{"$f":"IF(AND(入力シート!$B35<>\"\",入力シート!G35<>\"\"),入力シート!G35,\"\")","v":""},{"$f":"IF(AND(入力シート!$B35<>\"\",入力シート!H35<>\"\"),入力シート!H35,\"\")","v":""},{"$f":"IF(AND(入力シート!$B35<>\"\",入力シート!I35<>\"\"),入力シート!I35,\"\")","v":""},{"$f":"IF(AND(入力シート!$B35<>\"\",入力シート!J35<>\"\"),入力シート!J35,\"\")","v":""},{"$f":"IF(AND(入力シート!$B35<>\"\",入力シート!K35<>\"\"),入力シート!K35,\"\")","v":""},{"$f":"IF(AND(入力シート!$B35<>\"\",入力シート!L35<>\"\"),入力シート!L35,\"\")","v":""},{"$f":"IF(AND(入力シート!$B35<>\"\",入力シート!M35<>\"\"),入力シート!M35,\"\")","v":""},{"$f":"IF(AND(入力シート!$B35<>\"\",入力シート!N35<>\"\"),入力シート!N35,\"\")","v":""},{"$f":"IF(AND(入力シート!$B35<>\"\",入力シート!O35<>\"\"),入力シート!O35,\"\")","v":""},{"$f":"IF(AND(入力シート!$B35<>\"\",入力シート!P35<>\"\"),入力シート!P35,\"\")","v":""},{"$f":"IF(AND(入力シート!$B35<>\"\",入力シート!Q35<>\"\"),入力シート!Q35,\"\")","v":""},{"$f":"IF(入力シート!O20<>\"\",入力シート!O20,\"\")","v":""},{"$f":"IF(入力シート!P20<>\"\",入力シート!P20,\"\")","v":""},{"$f":"IF(入力シート!Q20<>\"\",入力シート!Q20,\"\")","v":""},{"$f":"IF(入力シート!R20<>\"\",入力シート!R20,\"\")","v":""},{"$f":"IF(入力シート!S20<>\"\",入力シート!S20,\"\")","v":""},{"$f":"IF(入力シート!T20<>\"\",入力シート!T20,\"\")","v":""}]
[]
["平面図",{"$nulls":21},{"$f":"IF(入力シート!B36<>\"\",入力シート!B36,\"\")","v":""},3,"記入不要",{"$nulls":8},2,{"$f":"IF(AND(入力シート!$B36<>\"\",入力シート!C36<>\"\"),入力シート!C36,\"\")","v":""},{"$f":"IF(AND(入力シート!$B36<>\"\",入力シート!D36<>\"\"),入力シート!D36,\"\")","v":""},{"$f":"IF(AND(入力シート!$B36<>\"\",入力シート!E36<>\"\"),入力シート!E36,\"\")","v":""},{"$f":"IF(AND(入力シート!$B36<>\"\",入力シート!F36<>\"\"),入力シート!F36,\"\")","v":""},null,{"$f":"IF(AND(入力シート!$B36<>\"\",入力シート!G36<>\"\"),入力シート!G36,\"\")","v":""},{"$f":"IF(AND(入力シート!$B36<>\"\",入力シート!H36<>\"\"),入力シート!H36,\"\")","v":""},{"$f":"IF(AND(入力シート!$B36<>\"\",入力シート!I36<>\"\"),入力シート!I36,\"\")","v":""},{"$f":"IF(AND(入力シート!$B36<>\"\",入力シート!J36<>\"\"),入力シート!J36,\"\")","v":""},{"$f":"IF(AND(入力シート!$B36<>\"\",入力シート!K36<>\"\"),入力シート!K36,\"\")","v":""},{"$f":"IF(AND(入力シート!$B36<>\"\",入力シート!L36<>\"\"),入力シート!L36,\"\")","v":""},{"$f":"IF(AND(入力シート!$B36<>\"\",入力シート!M36<>\"\"),入力シート!M36,\"\")","v":""},{"$f":"IF(AND(入力シート!$B36<>\"\",入力シート!N36<>\"\"),入力シート!N36,\"\")","v":""},"記入不要",null,null,"記入不要"]
[]
[{"$nulls":22},{"$f":"IF(入力シート!B37<>\"\",入力シート!B37,\"\")","v":""},3,"記入不要",{"$nulls":8},2,{"$f":"IF(AND(入力シート!$B37<>\"\",入力シート!C37<>\"\"),入力シート!C37,\"\")","v":""},{"$f":"IF(AND(入力シート!$B37<>\"\",入力シート!D37<>\"\"),入力シート!D37,\"\")","v":""},{"$f":"IF(AND(入力シート!$B37<>\"\",入力シート!E37<>\"\"),入力シート!E37,\"\")","v":""},{"$f":"IF(AND(入力シート!$B37<>\"\",入力シート!F37<>\"\"),入力シート!F37,\"\")","v":""},null,{"$f":"IF(AND(入力シート!$B37<>\"\",入力シート!G37<>\"\"),入力シート!G37,\"\")","v":""},{"$f":"IF(AND(入力シート!$B37<>\"\",入力シート!H37<>\"\"),入力シート!H37,\"\")","v":""},{"$f":"IF(AND(入力シート!$B37<>\"\",入力シート!I37<>\"\"),入力シート!I37,\"\")","v":""},{"$f":"IF(AND(入力シート!$B37<>\"\",入力シート!J37<>\"\"),入力シート!J37,\"\")","v":""},{"$f":"IF(AND(入力シート!$B37<>\"\",入力シート!K37<>\"\"),入力シート!K37,\"\")","v":""},{"$f":"IF(AND(入力シート!$B37<>\"\",入力シート!L37<>\"\"),入力シート!L37,\"\")","v":""},{"$f":"IF(AND(入力シート!$B37<>\"\",入力シート!M37<>\"\"),入力シート!M37,\"\")","v":""},{"$f":"IF(AND(入力シート!$B37<>\"\",入力シート!N37<>\"\"),入力シート!N37,\"\")","v":""},"記入不要",null,null,"記入不要"]
[]
[{"$nulls":47},"部修は記入不要"]
[]
[{"$nulls":22},"カード№","原票区分","訂　正",null,"撤去予定",{"$nulls":3},"営業受付No",{"$nulls":4},"撤去\n設計No",{"$nulls":12},"引込アーム",{"$nulls":4},"HS防護",null,"その他割増","違反件数","インプット\n\nチェック"]
[{"$nulls":48},"本柱材質","種別","長さ","アームタイ"]
[{"$nulls":26},"月",null,"日"]
[]
[{"$nulls":22},14,15,16,17,18,19,20,21,22,23,24,25,26,27,28,29,30,31,32,33,34,35,36,37,38,39,40,41,42,43,44,45,46,47,48]
[{"$nulls":22},{"$f":"IF(入力シート!B44<>\"\",入力シート!B44,\"\")","v":""},4,{"$f":"IF(AND(入力シート!B44<>\"\",入力シート!C44<>\"\"),入力シート!C44,\"\")","v":""},null,{"$f":"IF(AND(入力シート!$B44<>\"\",入力シート!D44<>\"\"),入力シート!D44,\"\")","v":""},{"$f":"IF(AND(入力シート!$B44<>\"\",入力シート!E44<>\"\"),入力シート!E44,\"\")","v":""},{"$f":"IF(AND(入力シート!$B44<>\"\",入力シート!F44<>\"\"),入力シート!F44,\"\")","v":""},{"$f":"IF(AND(入力シート!$B44<>\"\",入力シート!G44<>\"\"),入力シート!G44,\"\")","v":""},{"$f":"IF(AND(入力シート!$B44<>\"\",入力シート!H44<>\"\"),入力シート!H44,\"\")","v":""},{"$f":"IF(AND(入力シート!$B44<>\"\",入力シート!I44<>\"\"),入力シート!I44,\"\")","v":""},{"$f":"IF(AND(入力シート!$B44<>\"\",入力シート!J44<>\"\"),入力シート!J44,\"\")","v":""},{"$f":"IF(AND(入力シート!$B44<>\"\",入力シート!K44<>\"\"),入力シート!K44,\"\")","v":""},{"$f":"IF(AND(入力シート!$B44<>\"\",入力シート!L44<>\"\"),入力シート!L44,\"\")","v":""},{"$nulls":13},{"$f":"IF(AND(入力シート!$B44,入力シート!P44<>\"\"),入力シート!P44,\"\")","v":""},{"$f":"IF(AND(入力シート!$B44,入力シート!Q44<>\"\"),入力シート!Q44,\"\")","v":""},{"$f":"IF(AND(入力シート!$B44,入力シート!R44<>\"\"),入力シート!R44,\"\")","v":""},{"$f":"IF(AND(入力シート!$B44,入力シート!S44<>\"\"),入力シート!S44,\"\")","v":""},null,{"$f":"IF(AND(入力シート!$B44,入力シート!U44<>\"\"),入力シート!U44,\"\")","v":""},null,{"$f":"IF(AND(入力シート!$B44,入力シート!V44<>\"\"),入力シート!V44,\"\")","v":""},{"$f":"IF(AND(入力シート!$B44,入力シート!W44<>\"\"),入力シート!W44,\"\")","v":""}]
[]
[{"$nulls":26},"部修は記入不要",{"$nulls":8},"部修のみ記入",{"$nulls":8},"道路横断の\n有無",{"$nulls":5},{"$f":"IF(入力シート!O27<>\"\",入力シート!O27,\"\")","v":""}]
[]
[]
[{"$nulls":44},"道路上最低点\n地上高",{"$nulls":5},"設計",{"$nulls":4},"工事後"]
[{"$nulls":51},{"$f":"IF(入力シート!O28<>\"\",入力シート!O28,\"\")","v":""}]
[{"$nulls":54},"ｍ",{"$nulls":4},"ｍ"]
[{"$nulls":44},"径間長",{"$nulls":3},"単独",{"$f":"IF(入力シート!U27<>\"\",入力シート!U27,\"\")","v":""},{"$nulls":3},"ｍ","連接",{"$f":"IF(入力シート!U28<>\"\",入力シート!U28,\"\")","v":""},{"$nulls":3},"ｍ"]
[]
[]
[{"$nulls":40},"自主検査項目",{"$nulls":5},"点検日",null,"年　　　月　　　日",{"$nulls":5},"点検者",{"$nulls":4},"✓"]
[{"$nulls":40},"（工事会社記入欄）"]
[{"$nulls":40},1,"キズまたはキンクのある電線を使用していないか"]
[{"$nulls":40},2,"地表上の高さはよいか"]
[{"$nulls":40},3,"他物との離隔はよいか"]
[{"$nulls":29},"撤去工事完了連絡",{"$nulls":10},4,"電線の接続および接続後の処理はよいか"]
[{"$nulls":29},"工事会社",{"$nulls":10},5,"ち度は規定に適合しているか"]
[{"$nulls":29},"責任者",{"$nulls":10},6,"配色と色別区分はよいか"]
["＜備考＞撤去工事分の「臨時引込線工事設計書」は、新設分記入後の承認書コピーを",{"$nulls":28},"引込線",null,null,"　　　年　　　月　　　日",{"$nulls":7},7,"家屋側支持点・ケーブルの取り付け工事はよいか"]
["　　　　使用することができます。ただし、撤去の設計No．は新設分＋１とします。",{"$nulls":28},"撤去日",{"$nulls":10},8,"資材は、当社指定品を使用しているか"]
[{"$nulls":7},"当社柱",{"$nulls":4},"低圧線",{"$nulls":4},"径間長",{"$nulls":4},"引込線　電灯-単独",{"$nulls":6},"引込線　電灯-メッセン"]
[]
[]
[]
[{"$nulls":7},"変圧器柱",{"$nulls":4},"引込線",{"$nulls":4},"空のテキスト",{"$nulls":4},"引込線　電力-単独",{"$nulls":6},"引込線　電力-メッセン"]
[]
[]
[]
[{"$nulls":7},"ＮＴＴ柱",{"$nulls":4},"メッセンジャー",{"$nulls":4},"お客さま受電柱"]

{"sheet":"撤去","index":2,"n_rows":55,"n_cols":60,"rows_kept":55,"merged":[[0,11,1,38],[0,48,0,51],[0,52,0,55],[0,56,0,59],[1,48,3,51],[1,52,3,55],[1,56,3,59],[2,0,2,3],[2,4,3,20],[2,21,2,22],[2,23,3,45],[4,0,5,3],[4,4,4,5],[4,6,5,9],[4,13,4,14],[4,15,5,18],[4,21,5,21],[4,22,4,24],[4,25,5,34],[4,35,4,37],[4,38,5,45],[5,22,5,24],[7,9,7,12],[7,13,10,18],[7,19,10,21],[7,22,10,22],[7,23,10,23],[7,24,7,32],[7,33,10,33],[7,34,10,34],[7,35,10,35],[7,36,7,45],[7,46,10,46],[7,47,10,49],[7,50,8,55],[7,56,10,56],[7,57,11,59],[8,9,10,9],[8,10,10,10],[8,11,10,11],[8,12,10,12],[8,24,10,26],[8,27,8,32],[8,36,10,36],[8,37,8,39],[8,40,10,40],[8,41,10,41],[8,42,10,42],[8,43,10,43],[8,44,10,45],[9,27,10,28],[9,29,10,30],[9,31,10,32],[9,37,9,38],[9,39,10,39],[9,50,10,51],[9,52,10,53],[9,54,10,55],[12,9,13,9],[12,10,13,10],[12,11,13,11],[12,12,13,12],[12,13,13,13],[12,14,13,14],[12,15,13,15],[12,16,13,16],[12,17,13,17],[12,18,13,18],[12,19,13,19],[12,20,13,20],[12,21,13,21],[12,22,13,22],[12,23,13,23],[12,24,13,24],[12,25,13,25],[12,26,13,26],[12,27,13,27],[12,28,13,28],[12,29,13,29],[12,30,13,30],[12,31,13,31],[12,32,13,32],[12,33,13,33],[12,34,13,34],[12,35,13,35],[12,36,13,36],[12,37,13,37],[12,38,13,38],[12,39,13,39],[12,40,13,40],[12,41,13,41],[12,42,13,42],[12,43,13,43],[12,44,13,44],[12,45,13,45],[12,46,13,46],[12,47,13,47],[12,48,13,48],[12,49,13,49],[12,50,13,50],[12,51,13,51],[12,52,13,52],[12,53,13,53],[12,54,13,54],[12,55,13,55],[12,56,13,56],[14,0,15,4],[14,22,15,22],[14,23,15,23],[14,24,15,32],[14,33,15,33],[14,34,15,34],[14,35,15,35],[14,36,15,36],[14,37,15,37],[14,38,15,38],[14,39,15,39],[14,40,15,40],[14,41,15,41],[14,42,15,42],[14,43,15,43],[14,44,15,44],[14,45,15,45],[14,46,15,46],[14,47,15,49],[14,50,15,55],[14,56,15,56],[16,22,17,22],[16,23,17,23],[16,24,17,32],[16,33,17,33],[16,34,17,34],[16,35,17,35],[16,36,17,36],[16,37,17,37],[16,38,17,38],[16,39,17,39],[16,40,17,40],[16,41,17,41],[16,42,17,42],[16,43,17,43],[16,44,17,44],[16,45,17,45],[16,46,17,46],[16,47,17,49],[16,50,17,55],[16,56,17,56],[18,47,18,56],[20,22,23,22],[20,23,23,23],[20,24,23,24],[20,25,23,25],[20,26,21,29],[20,30,23,34],[20,35,23,37],[20,38,23,47],[20,48,20,51],[20,52,23,52],[20,53,23,53],[20,54,23,54],[20,55,23,55],[20,56,23,56],[20,57,24,59],[21,48,23,48],[21,49,23,49],[21,50,23,50],[21,51,23,51],[22,26,23,27],[22,28,23,29],[25,22,26,22],[25,23,26,23],[25,24,26,24],[25,25,26,25],[25,26,26,26],[25,27,26,27],[25,28,26,28],[25,29,26,29],[25,30,26,30],[25,31,26,31],[25,32,26,32],[25,33,26,33],[25,34,26,34],[25,35,26,35],[25,36,26,36],[25,37,26,37],[25,38,26,38],[25,39,26,39],[25,40,26,40],[25,41,26,41],[25,42,26,42],[25,43,26,43],[25,44,26,44],[25,45,26,45],[25,46,26,46],[25,47,26,47],[25,48,26,48],[25,49,26,49],[25,50,26,50],[25,51,26,51],[25,52,26,52],[25,53,26,53],[25,54,26,54],[25,55,26,55],[25,56,26,56],[27,26,27,34],[27,35,27,37],[27,44,29,49],[27,50,29,59],[30,44,32,49],[31,51,32,53],[31,56,32,58],[33,44,35,47],[33,48,35,48],[33,49,35,52],[33,53,35,53],[33,54,35,54],[33,55,35,58],[33,59,35,59],[36,40,36,45],[36,46,37,47],[36,48,37,53],[36,54,37,55],[36,56,37,58],[36,59,37,59],[37,40,37,45],[38,41,38,58],[39,41,39,58],[40,41,40,58],[41,29,41,39],[41,41,41,58],[42,29,42,31],[42,32,43,39],[42,41,42,58],[43,29,43,31],[43,41,43,58],[44,29,44,31],[44,32,45,39],[44,41,44,58],[45,29,45,31],[45,41,45,58]]}
[{"$f":"新設!A1","v":"ver2.04(2021.9)"},{"$nulls":10},"　臨時引込線工事設計書（撤去）",{"$nulls":36},"上長",{"$nulls":3},"検収担当",{"$nulls":3},"設計照査"]
[{"$f":"IF(入力シート!N11<>\"\",\"NW受付番号：\" & 入力シート!N11,\"NW受付番号：\")","v":"NW受付番号："}]
["お客さま名",{"$nulls":3},{"$f":"IF(入力シート!B6<>\"\",入力シート!B6,\"\")","v":""},{"$nulls":16},"住所",null,{"$f":"IF(入力シート!B4<>\"\",入力シート!B4,\"\")","v":""}]
[]
["申し込み\n内容",{"$nulls":3},"電灯",null,"-",{"$nulls":6},"電力",null,"-",{"$nulls":5},"設計","工事",null,null,{"$f":"IF(入力シート!B13<>\"\",入力シート!B13,\"\")","v":""},{"$nulls":9},"担当者",null,null,{"$f":"IF(入力シート!B15<>\"\",入力シート!B15,\"\")","v":""}]
[{"$nulls":12},{"$f":"IF(入力シート!F24<>\"\",入力シート!F24,\"\")","v":"A"},{"$nulls":7},"kW",null,"会社名"]
[]
[{"$nulls":9},"事業所",{"$nulls":3},"工事会社",{"$nulls":5},"設計書No",null,null,"カード№","原票区分",{"$nulls":9},"工事区分","訂　正","付　外","引　込　線",{"$nulls":9},"設計工量","供給\nKW\n(100W)",null,null,"引込柱No",{"$nulls":6},"インプット\n\nチェック"]
[{"$nulls":9},"支店","営業支店","営業所","グループ",{"$nulls":11},"営業所",null,null,"メッシュNo",{"$nulls":8},"灯　力","パターン",null,null,"条　数","電話防護","太　さ","口　数","総亘長"]
[{"$nulls":27},"画",null,"区",null,"図",{"$nulls":5},"方式",null,"線種",{"$nulls":10},"番",null,"の",null,"号"]
[{"$nulls":37},1,2]
[{"$nulls":9},1,2,3,4,5,6,7,8,9,10,11,12,13,14,15,16,17,18,19,20,21,22,23,24,25,26,27,28,29,30,31,32,33,34,35,36,37,38,39,40,41,42,43,44,45,46,47,48]
[{"$nulls":9},{"$f":"IF(入力シート!B9<>\"\",入力シート!B9,\"\")","v":""},{"$f":"IF(入力シート!D9<>\"\",入力シート!D9,\"\")","v":""},{"$f":"IF(入力シート!E9<>\"\",入力シート!E9,\"\")","v":""},{"$f":"IF(入力シート!F9<>\"\",入力シート!F9,\"\")","v":""},{"$f":"IF(入力シート!B11<>\"\",入力シート!B11,\"\")","v":""},{"$f":"IF(入力シート!C11<>\"\",入力シート!C11,\"\")","v":""},"-",{"$f":"IF(入力シート!E11<>\"\",入力シート!E11,\"\")","v":""},{"$f":"IF(入力シート!F11<>\"\",入力シート!F11,\"\")","v":""},{"$f":"IF(入力シート!G11<>\"\",入力シート!G11,\"\")","v":""},{"$f":"IF(入力シート!B17<>\"\",MID(コード変換!H5,1,1),\"\")","v":""},{"$f":"IF(入力シート!B17<>\"\",MID(コード変換!H5,2,1),\"\")","v":""},{"$f":"IF(入力シート!B17<>\"\",MID(コード変換!H5,3,1),\"\")","v":""},{"$f":"IF(入力シート!B35<>\"\",入力シート!B35,\"\")","v":""},3,{"$f":"IF(入力シート!G9<>\"\",入力シート!G9,\"\")","v":""},{"$f":"IF(入力シート!H9<>\"\",入力シート!H9,\"\")","v":""},0,{"$f":"IF(入力シート!I20<>\"\",入力シート!I20,\"\")","v":""},{"$f":"IF(入力シート!J20<>\"\",入力シート!J20,\"\")","v":""},{"$f":"IF(入力シート!K20<>\"\",入力シート!K20,\"\")","v":""},{"$f":"IF(入力シート!L20<>\"\",入力シート!L20,\"\")","v":""},{"$f":"IF(入力シート!M20<>\"\",入力シート!M20,\"\")","v":""},{"$f":"IF(入力シート!N20<>\"\",入力シート!N20,\"\")","v":""},2,{"$f":"IF(AND(入力シート!$B35<>\"\",入力シート!C35<>\"\"),入力シート!C35,\"\")","v":""},{"$f":"IF(AND(入力シート!$B35<>\"\",入力シート!D35<>\"\"),\"取外\",\"\")","v":""},{"$f":"IF(AND(入力シート!$B35<>\"\",入力シート!E35<>\"\"),入力シート!E35,\"\")","v":""},{"$f":"IF(AND(入力シート!$B35<>\"\",入力シート!F35<>\"\"),入力シート!F35,\"\")","v":""},null,{"$f":"IF(AND(入力シート!$B35<>\"\",入力シート!G35<>\"\"),入力シート!G35,\"\")","v":""},{"$f":"IF(AND(入力シート!$B35<>\"\",入力シート!H35<>\"\"),入力シート!H35,\"\")","v":""},{"$f":"IF(AND(入力シート!$B35<>\"\",入力シート!I35<>\"\"),入力シート!I35,\"\")","v":""},{"$f":"IF(AND(入力シート!$B35<>\"\",入力シート!J35<>\"\"),入力シート!J35,\"\")","v":""},{"$f":"IF(AND(入力シート!$B35<>\"\",入力シート!K35<>\"\"),入力シート!K35,\"\")","v":""},{"$f":"IF(AND(入力シート!$B35<>\"\",入力シート!L35<>\"\"),入力シート!L35,\"\")","v":""},{"$f":"IF(AND(入力シート!$B35<>\"\",入力シート!M35<>\"\"),入力シート!M35,\"\")","v":""},{"$f":"IF(AND(入力シート!$B35<>\"\",入力シート!N35<>\"\"),\"不\",\"\")","v":""},{"$f":"IF(AND(入力シート!$B35<>\"\",入力シート!O35<>\"\"),0,\"\")","v":""},{"$f":"IF(AND(入力シート!$B35<>\"\",入力シート!P35<>\"\"),0,\"\")","v":""},{"$f":"IF(AND(入力シート!$B35<>\"\",入力シート!Q35<>\"\"),0,\"\")","v":""},{"$f":"IF(入力シート!O20<>\"\",入力シート!O20,\"\")","v":""},{"$f":"IF(入力シート!P20<>\"\",入力シート!P20,\"\")","v":""},{"$f":"IF(入力シート!Q20<>\"\",入力シート!Q20,\"\")","v":""},{"$f":"IF(入力シート!R20<>\"\",入力シート!R20,\"\")","v":""},{"$f":"IF(入力シート!S20<>\"\",入力シート!S20,\"\")","v":""},{"$f":"IF(入力シート!T20<>\"\",入力シート!T20,\"\")","v":""}]
[]
["平面図",{"$nulls":21},{"$f":"IF(入力シート!B36<>\"\",入力シート!B36,\"\")","v":""},3,"記入不要",{"$nulls":8},2,{"$f":"IF(AND(入力シート!$B36<>\"\",入力シート!C36<>\"\"),入力シート!C36,\"\")","v":""},{"$f":"IF(AND(入力シート!$B36<>\"\",入力シート!D36<>\"\"),\"取外\",\"\")","v":""},{"$f":"IF(AND(入力シート!$B36<>\"\",入力シート!E36<>\"\"),入力シート!E36,\"\")","v":""},{"$f":"IF(AND(入力シート!$B36<>\"\",入力シート!F36<>\"\"),入力シート!F36,\"\")","v":""},null,{"$f":"IF(AND(入力シート!$B36<>\"\",入力シート!G36<>\"\"),入力シート!G36,\"\")","v":""},{"$f":"IF(AND(入力シート!$B36<>\"\",入力シート!H36<>\"\"),入力シート!H36,\"\")","v":""},{"$f":"IF(AND(入力シート!$B36<>\"\",入力シート!I36<>\"\"),入力シート!I36,\"\")","v":""},{"$f":"IF(AND(入力シート!$B36<>\"\",入力シート!J36<>\"\"),入力シート!J36,\"\")","v":""},{"$f":"IF(AND(入力シート!$B36<>\"\",入力シート!K36<>\"\"),入力シート!K36,\"\")","v":""},{"$f":"IF(AND(入力シート!$B36<>\"\",入力シート!L36<>\"\"),入力シート!L36,\"\")","v":""},{"$f":"IF(AND(入力シート!$B36<>\"\",入力シート!M36<>\"\"),入力シート!M36,\"\")","v":""},{"$f":"IF(AND(入力シート!$B36<>\"\",入力シート!N36<>\"\"),\"不\",\"\")","v":""},"記入不要",null,null,"記入不要"]
[]
[{"$nulls":22},{"$f":"IF(入力シート!B37<>\"\",入力シート!B37,\"\")","v":""},3,"記入不要",{"$nulls":8},2,{"$f":"IF(AND(入力シート!$B37<>\"\",入力シート!C37<>\"\"),入力シート!C37,\"\")","v":""},{"$f":"IF(AND(入力シート!$B37<>\"\",入力シート!D37<>\"\"),\"取外\",\"\")","v":""},{"$f":"IF(AND(入力シート!$B37<>\"\",入力シート!E37<>\"\"),入力シート!E37,\"\")","v":""},{"$f":"IF(AND(入力シート!$B37<>\"\",入力シート!F37<>\"\"),入力シート!F37,\"\")","v":""},null,{"$f":"IF(AND(入力シート!$B37<>\"\",入力シート!G37<>\"\"),入力シート!G37,\"\")","v":""},{"$f":"IF(AND(入力シート!$B37<>\"\",入力シート!H37<>\"\"),入力シート!H37,\"\")","v":""},{"$f":"IF(AND(入力シート!$B37<>\"\",入力シート!I37<>\"\"),入力シート!I37,\"\")","v":""},{"$f":"IF(AND(入力シート!$B37<>\"\",入力シート!J37<>\"\"),入力シート!J37,\"\")","v":""},{"$f":"IF(AND(入力シート!$B37<>\"\",入力シート!K37<>\"\"),入力シート!K37,\"\")","v":""},{"$f":"IF(AND(入力シート!$B37<>\"\",入力シート!L37<>\"\"),入力シート!L37,\"\")","v":""},{"$f":"IF(AND(入力シート!$B37<>\"\",入力シート!M37<>\"\"),入力シート!M37,\"\")","v":""},{"$f":"IF(AND(入力シート!$B37<>\"\",入力シート!N37<>\"\"),\"不\",\"\")","v":""},"記入不要",null,null,"記入不要"]
[]
[{"$nulls":47},"部修は記入不要"]
[]
[{"$nulls":22},"カード№","原票区分","訂　正",null,"撤去予定",{"$nulls":3},"営業受付No",{"$nulls":4},"撤去\n設計No",{"$nulls":12},"引込アーム",{"$nulls":4},"HS防護",null,"その他割増","違反件数","インプット\n\nチェック"]
[{"$nulls":48},"本柱材質","種別","長さ","アームタイ"]
[{"$nulls":26},"月",null,"日"]
[]
[{"$nulls":22},14,15,16,17,18,19,20,21,22,23,24,25,26,27,28,29,30,31,32,33,34,35,36,37,38,39,40,41,42,43,44,45,46,47,48]
[{"$nulls":22},{"$f":"IF(入力シート!B44<>\"\",入力シート!B44,\"\")","v":""},4,{"$f":"IF(AND(入力シート!B44<>\"\",入力シート!C44<>\"\"),入力シート!C44,\"\")","v":""},null,{"$f":"IF(AND(入力シート!$B44<>\"\",入力シート!D44<>\"\"),入力シート!D44,\"\")","v":""},{"$f":"IF(AND(入力シート!$B44<>\"\",入力シート!E44<>\"\"),入力シート!E44,\"\")","v":""},{"$f":"IF(AND(入力シート!$B44<>\"\",入力シート!F44<>\"\"),入力シート!F44,\"\")","v":""},{"$f":"IF(AND(入力シート!$B44<>\"\",入力シート!G44<>\"\"),入力シート!G44,\"\")","v":""},{"$f":"IF(AND(入力シート!$B44<>\"\",入力シート!H44<>\"\"),入力シート!H44,\"\")","v":""},{"$f":"IF(AND(入力シート!$B44<>\"\",入力シート!I44<>\"\"),入力シート!I44,\"\")","v":""},{"$f":"IF(AND(入力シート!$B44<>\"\",入力シート!J44<>\"\"),入力シート!J44,\"\")","v":""},{"$f":"IF(AND(入力シート!$B44<>\"\",入力シート!K44<>\"\"),入力シート!K44,\"\")","v":""},{"$f":"IF(AND(入力シート!$B44<>\"\",入力シート!L44<>\"\"),入力シート!L44,\"\")","v":""},{"$nulls":13},{"$f":"IF(AND(入力シート!$B44,入力シート!P44<>\"\"),入力シート!P44,\"\")","v":""},{"$f":"IF(AND(入力シート!$B44,入力シート!Q44<>\"\"),入力シート!Q44,\"\")","v":""},{"$f":"IF(AND(入力シート!$B44,入力シート!R44<>\"\"),入力シート!R44,\"\")","v":""},{"$f":"IF(AND(入力シート!$B44,入力シート!S44<>\"\"),入力シート!S44,\"\")","v":""},null,{"$f":"IF(AND(入力シート!$B44,入力シート!U44<>\"\"),入力シート!U44,\"\")","v":""},null,{"$f":"IF(AND(入力シート!$B44,入力シート!V44<>\"\"),入力シート!V44,\"\")","v":""},{"$f":"IF(AND(入力シート!$B44,入力シート!W44<>\"\"),入力シート!W44,\"\")","v":""}]
[]
[{"$nulls":26},"部修は記入不要",{"$nulls":8},"部修のみ記入",{"$nulls":8},"道路横断の\n有無",{"$nulls":5},{"$f":"IF(入力シート!O27<>\"\",入力シート!O27,\"\")","v":""}]
[]
[]
[{"$nulls":44},"道路上最低点\n地上高",{"$nulls":5},"設計",{"$nulls":4},"工事後"]
[{"$nulls":51},{"$f":"IF(入力シート!O28<>\"\",入力シート!O28,\"\")","v":""}]
[{"$nulls":54},"ｍ",{"$nulls":4},"ｍ"]
[{"$nulls":44},"径間長",{"$nulls":3},"単独",{"$f":"IF(入力シート!U27<>\"\",入力シート!U27,\"\")","v":""},{"$nulls":3},"ｍ","連接",{"$f":"IF(入力シート!U28<>\"\",入力シート!U28,\"\")","v":""},{"$nulls":3},"ｍ"]
[]
[]
[{"$nulls":40},"自主検査項目",{"$nulls":5},"点検日",null,"年　　　月　　　日",{"$nulls":5},"点検者",{"$nulls":4},"✓"]
[{"$nulls":40},"（工事会社記入欄）"]
[{"$nulls":40},1,"キズまたはキンクのある電線を使用していないか"]
[{"$nulls":40},2,"地表上の高さはよいか"]
[{"$nulls":40},3,"他物との離隔はよいか"]
[{"$nulls":29},"撤去工事完了連絡",{"$nulls":10},4,"電線の接続および接続後の処理はよいか"]
[{"$nulls":29},"工事会社",{"$nulls":10},5,"ち度は規定に適合しているか"]
[{"$nulls":29},"責任者",{"$nulls":10},6,"配色と色別区分はよいか"]
["＜備考＞撤去工事分の「臨時引込線工事設計書」は、新設分記入後の承認書コピーを",{"$nulls":28},"引込線",null,null,"　　　年　　　月　　　日",{"$nulls":7},7,"家屋側支持点・ケーブルの取り付け工事はよいか"]
["　　　　使用することができます。ただし、撤去の設計No．は新設分＋１とします。",{"$nulls":28},"撤去日",{"$nulls":10},8,"資材は、当社指定品を使用しているか"]
[{"$nulls":7},"当社柱",{"$nulls":4},"低圧線",{"$nulls":4},"径間長",{"$nulls":4},"引込線　電灯-単独",{"$nulls":6},"引込線　電灯-メッセン"]
[]
[]
[]
[{"$nulls":7},"変圧器柱",{"$nulls":4},"引込線",{"$nulls":4},"空のテキスト",{"$nulls":4},"引込線　電力-単独",{"$nulls":6},"引込線　電力-メッセン"]
[]
[]
[]
[{"$nulls":7},"ＮＴＴ柱",{"$nulls":4},"メッセンジャー",{"$nulls":4},"お客さま受電柱",{"$nulls":4},"取り外し記号"]

{"sheet":"部修","index":3,"n_rows":55,"n_cols":60,"rows_kept":55,"merged":[[0,11,1,38],[0,48,0,51],[0,52,0,55],[0,56,0,59],[1,48,3,51],[1,52,3,55],[1,56,3,59],[2,0,2,3],[2,4,3,20],[2,21,2,22],[2,23,3,45],[4,0,5,3],[4,4,4,5],[4,6,5,9],[4,13,4,14],[4,15,5,18],[4,21,5,21],[4,22,4,24],[4,25,5,34],[4,35,4,37],[4,38,5,45],[5,22,5,24],[7,9,7,12],[7,13,10,18],[7,19,10,21],[7,22,10,22],[7,23,10,23],[7,24,7,32],[7,33,10,33],[7,34,10,34],[7,35,10,35],[7,36,7,45],[7,46,10,46],[7,47,10,49],[7,50,8,55],[7,56,10,56],[7,57,11,59],[8,9,10,9],[8,10,10,10],[8,11,10,11],[8,12,10,12],[8,24,10,26],[8,27,8,32],[8,36,10,36],[8,37,8,39],[8,40,10,40],[8,41,10,41],[8,42,10,42],[8,43,10,43],[8,44,10,45],[9,27,10,28],[9,29,10,30],[9,31,10,32],[9,37,9,38],[9,39,10,39],[9,50,10,51],[9,52,10,53],[9,54,10,55],[12,9,13,9],[12,10,13,10],[12,11,13,11],[12,12,13,12],[12,13,13,13],[12,14,13,14],[12,15,13,15],[12,16,13,16],[12,17,13,17],[12,18,13,18],[12,19,13,19],[12,20,13,20],[12,21,13,21],[12,22,13,22],[12,23,13,23],[12,24,13,24],[12,25,13,25],[12,26,13,26],[12,27,13,27],[12,28,13,28],[12,29,13,29],[12,30,13,30],[12,31,13,31],[12,32,13,32],[12,33,13,33],[12,34,13,34],[12,35,13,35],[12,36,13,36],[12,37,13,37],[12,38,13,38],[12,39,13,39],[12,40,13,40],[12,41,13,41],[12,42,13,42],[12,43,13,43],[12,44,13,44],[12,45,13,45],[12,46,13,46],[12,47,13,47],[12,48,13,48],[12,49,13,49],[12,50,13,50],[12,51,13,51],[12,52,13,52],[12,53,13,53],[12,54,13,54],[12,55,13,55],[12,56,13,56],[14,0,15,4],[14,22,15,22],[14,23,15,23],[14,24,15,32],[14,33,15,33],[14,34,15,34],[14,35,15,35],[14,36,15,36],[14,37,15,37],[14,38,15,38],[14,39,15,39],[14,40,15,40],[14,41,15,41],[14,42,15,42],[14,43,15,43],[14,44,15,44],[14,45,15,45],[14,46,15,46],[14,47,15,49],[14,50,15,55],[14,56,15,56],[16,22,17,22],[16,23,17,23],[16,24,17,32],[16,33,17,33],[16,34,17,34],[16,35,17,35],[16,36,17,36],[16,37,17,37],[16,38,17,38],[16,39,17,39],[16,40,17,40],[16,41,17,41],[16,42,17,42],[16,43,17,43],[16,44,17,44],[16,45,17,45],[16,46,17,46],[16,47,17,49],[16,50,17,55],[16,56,17,56],[18,47,18,56],[20,22,23,22],[20,23,23,23],[20,24,23,24],[20,25,23,25],[20,26,21,29],[20,30,23,34],[20,35,23,37],[20,38,23,47],[20,48,20,51],[20,52,23,52],[20,53,23,53],[20,54,23,54],[20,55,23,55],[20,56,23,56],[20,57,24,59],[21,48,23,48],[21,49,23,49],[21,50,23,50],[21,51,23,51],[22,26,23,27],[22,28,23,29],[25,22,26,22],[25,23,26,23],[25,24,26,24],[25,25,26,25],[25,26,26,26],[25,27,26,27],[25,28,26,28],[25,29,26,29],[25,30,26,30],[25,31,26,31],[25,32,26,32],[25,33,26,33],[25,34,26,34],[25,35,26,35],[25,36,26,36],[25,37,26,37],[25,38,26,38],[25,39,26,39],[25,40,26,40],[25,41,26,41],[25,42,26,42],[25,43,26,43],[25,44,26,44],[25,45,26,45],[25,46,26,46],[25,47,26,47],[25,48,26,48],[25,49,26,49],[25,50,26,50],[25,51,26,51],[25,52,26,52],[25,53,26,53],[25,54,26,54],[25,55,26,55],[25,56,26,56],[27,26,27,34],[27,35,27,37],[27,44,29,49],[27,50,29,59],[30,44,32,49],[31,51,32,53],[31,56,32,58],[33,44,35,47],[33,48,35,48],[33,49,35,52],[33,53,35,53],[33,54,35,54],[33,55,35,58],[33,59,35,59],[36,40,36,45],[36,46,37,47],[36,48,37,53],[36,54,37,55],[36,56,37,58],[36,59,37,59],[37,40,37,45],[38,41,38,58],[39,41,39,58],[40,41,40,58],[41,29,41,39],[41,41,41,58],[42,29,42,31],[42,32,43,39],[42,41,42,58],[43,29,43,31],[43,41,43,58],[44,29,44,31],[44,32,45,39],[44,41,44,58],[45,29,45,31],[45,41,45,58]]}
[{"$f":"新設!A1","v":"ver2.04(2021.9)"},{"$nulls":10},"　臨時引込線工事設計書（部修）",{"$nulls":36},"上長",{"$nulls":3},"検収担当",{"$nulls":3},"設計照査"]
[{"$f":"IF(入力シート!N11<>\"\",\"NW受付番号：\" & 入力シート!N11,\"NW受付番号：\")","v":"NW受付番号："}]
["お客さま名",{"$nulls":3},{"$f":"IF(入力シート!B6<>\"\",入力シート!B6,\"\")","v":""},{"$nulls":16},"住所",null,{"$f":"IF(入力シート!B4<>\"\",入力シート!B4,\"\")","v":""}]
[]
["申し込み\n内容",{"$nulls":3},"電灯",null,{"$f":"IF(入力シート!D24<>\"\",入力シート!D24,\"\")","v":""},{"$nulls":6},"電力",null,{"$f":"IF(入力シート!K24<>\"\",入力シート!K24,\"\")","v":""},{"$nulls":5},"設計","工事",null,null,{"$f":"IF(入力シート!B13<>\"\",入力シート!B13,\"\")","v":""},{"$nulls":9},"担当者",null,null,{"$f":"IF(入力シート!B15<>\"\",入力シート!B15,\"\")","v":""}]
[{"$nulls":12},{"$f":"IF(入力シート!F24<>\"\",入力シート!F24,\"\")","v":"A"},{"$nulls":7},"kW",null,"会社名"]
[]
[{"$nulls":9},"事業所",{"$nulls":3},"工事会社",{"$nulls":5},"設計書No",null,null,"カード№","原票区分",{"$nulls":9},"工事区分","訂　正","付　外","引　込　線",{"$nulls":9},"設計工量","供給\nKW\n(100W)",null,null,"引込柱No",{"$nulls":6},"インプット\n\nチェック"]
[{"$nulls":9},"支店","営業支店","営業所","グループ",{"$nulls":11},"営業所",null,null,"メッシュNo",{"$nulls":8},"灯　力","パターン",null,null,"条　数","電話防護","太　さ","口　数","総亘長"]
[{"$nulls":27},"画",null,"区",null,"図",{"$nulls":5},"方式",null,"線種",{"$nulls":10},"番",null,"の",null,"号"]
[{"$nulls":37},1,2]
[{"$nulls":9},1,2,3,4,5,6,7,8,9,10,11,12,13,14,15,16,17,18,19,20,21,22,23,24,25,26,27,28,29,30,31,32,33,34,35,36,37,38,39,40,41,42,43,44,45,46,47,48]
[{"$nulls":9},{"$f":"IF(入力シート!B9<>\"\",入力シート!B9,\"\")","v":""},{"$f":"IF(入力シート!D9<>\"\",入力シート!D9,\"\")","v":""},{"$f":"IF(入力シート!E9<>\"\",入力シート!E9,\"\")","v":""},{"$f":"IF(入力シート!F9<>\"\",入力シート!F9,\"\")","v":""},{"$f":"IF(入力シート!B11<>\"\",入力シート!B11,\"\")","v":""},{"$f":"IF(入力シート!C11<>\"\",入力シート!C11,\"\")","v":""},"-",{"$f":"IF(入力シート!E11<>\"\",入力シート!E11,\"\")","v":""},{"$f":"IF(入力シート!F11<>\"\",入力シート!F11,\"\")","v":""},{"$f":"IF(入力シート!G11<>\"\",入力シート!G11,\"\")","v":""},{"$f":"IF(入力シート!B17<>\"\",入力シート!B17,\"\")","v":""},{"$f":"IF(入力シート!C17<>\"\",入力シート!C17,\"\")","v":""},{"$f":"IF(入力シート!D17<>\"\",入力シート!D17,\"\")","v":""},{"$f":"IF(入力シート!B35<>\"\",入力シート!B35,\"\")","v":""},3,{"$f":"IF(入力シート!G9<>\"\",入力シート!G9,\"\")","v":""},{"$f":"IF(入力シート!H9<>\"\",入力シート!H9,\"\")","v":""},0,{"$f":"IF(入力シート!I20<>\"\",入力シート!I20,\"\")","v":""},{"$f":"IF(入力シート!J20<>\"\",入力シート!J20,\"\")","v":""},{"$f":"IF(入力シート!K20<>\"\",入力シート!K20,\"\")","v":""},{"$f":"IF(入力シート!L20<>\"\",入力シート!L20,\"\")","v":""},{"$f":"IF(入力シート!M20<>\"\",入力シート!M20,\"\")","v":""},{"$f":"IF(入力シート!N20<>\"\",入力シート!N20,\"\")","v":""},2,{"$f":"IF(AND(入力シート!$B35<>\"\",入力シート!C35<>\"\"),入力シート!C35,\"\")","v":""},{"$f":"IF(AND(入力シート!$B35<>\"\",入力シート!D35<>\"\"),入力シート!D35,\"\")","v":""},{"$f":"IF(AND(入力シート!$B35<>\"\",入力シート!E35<>\"\"),入力シート!E35,\"\")","v":""},{"$f":"IF(AND(入力シート!$B35<>\"\",入力シート!F35<>\"\"),入力シート!F35,\"\")","v":""},null,{"$f":"IF(AND(入力シート!$B35<>\"\",入力シート!G35<>\"\"),入力シート!G35,\"\")","v":""},{"$f":"IF(AND(入力シート!$B35<>\"\",入力シート!H35<>\"\"),入力シート!H35,\"\")","v":""},{"$f":"IF(AND(入力シート!$B35<>\"\",入力シート!I35<>\"\"),入力シート!I35,\"\")","v":""},{"$f":"IF(AND(入力シート!$B35<>\"\",入力シート!J35<>\"\"),入力シート!J35,\"\")","v":""},{"$f":"IF(AND(入力シート!$B35<>\"\",入力シート!K35<>\"\"),入力シート!K35,\"\")","v":""},{"$f":"IF(AND(入力シート!$B35<>\"\",入力シート!L35<>\"\"),入力シート!L35,\"\")","v":""},{"$f":"IF(AND(入力シート!$B35<>\"\",入力シート!M35<>\"\"),入力シート!M35,\"\")","v":""},{"$f":"IF(AND(入力シート!$B35<>\"\",入力シート!N35<>\"\"),入力シート!N35,\"\")","v":""}]
[]
["平面図",{"$nulls":21},{"$f":"IF(入力シート!B36<>\"\",入力シート!B36,\"\")","v":""},3,"記入不要",{"$nulls":8},2,{"$f":"IF(AND(入力シート!$B36<>\"\",入力シート!C36<>\"\"),入力シート!C36,\"\")","v":""},{"$f":"IF(AND(入力シート!$B36<>\"\",入力シート!D36<>\"\"),入力シート!D36,\"\")","v":""},{"$f":"IF(AND(入力シート!$B36<>\"\",入力シート!E36<>\"\"),入力シート!E36,\"\")","v":""},{"$f":"IF(AND(入力シート!$B36<>\"\",入力シート!F36<>\"\"),入力シート!F36,\"\")","v":""},null,{"$f":"IF(AND(入力シート!$B36<>\"\",入力シート!G36<>\"\"),入力シート!G36,\"\")","v":""},{"$f":"IF(AND(入力シート!$B36<>\"\",入力シート!H36<>\"\"),入力シート!H36,\"\")","v":""},{"$f":"IF(AND(入力シート!$B36<>\"\",入力シート!I36<>\"\"),入力シート!I36,\"\")","v":""},{"$f":"IF(AND(入力シート!$B36<>\"\",入力シート!J36<>\"\"),入力シート!J36,\"\")","v":""},{"$f":"IF(AND(入力シート!$B36<>\"\",入力シート!K36<>\"\"),入力シート!K36,\"\")","v":""},{"$f":"IF(AND(入力シート!$B36<>\"\",入力シート!L36<>\"\"),入力シート!L36,\"\")","v":""},{"$f":"IF(AND(入力シート!$B36<>\"\",入力シート!M36<>\"\"),入力シート!M36,\"\")","v":""},{"$f":"IF(AND(入力シート!$B36<>\"\",入力シート!N36<>\"\"),入力シート!N36,\"\")","v":""},"記入不要",null,null,"記入不要"]
[]
[{"$nulls":22},{"$f":"IF(入力シート!B37<>\"\",入力シート!B37,\"\")","v":""},3,"記入不要",{"$nulls":8},2,{"$f":"IF(AND(入力シート!$B37<>\"\",入力シート!C37<>\"\"),入力シート!C37,\"\")","v":""},{"$f":"IF(AND(入力シート!$B37<>\"\",入力シート!D37<>\"\"),入力シート!D37,\"\")","v":""},{"$f":"IF(AND(入力シート!$B37<>\"\",入力シート!E37<>\"\"),入力シート!E37,\"\")","v":""},{"$f":"IF(AND(入力シート!$B37<>\"\",入力シート!F37<>\"\"),入力シート!F37,\"\")","v":""},null,{"$f":"IF(AND(入力シート!$B37<>\"\",入力シート!G37<>\"\"),入力シート!G37,\"\")","v":""},{"$f":"IF(AND(入力シート!$B37<>\"\",入力シート!H37<>\"\"),入力シート!H37,\"\")","v":""},{"$f":"IF(AND(入力シート!$B37<>\"\",入力シート!I37<>\"\"),入力シート!I37,\"\")","v":""},{"$f":"IF(AND(入力シート!$B37<>\"\",入力シート!J37<>\"\"),入力シート!J37,\"\")","v":""},{"$f":"IF(AND(入力シート!$B37<>\"\",入力シート!K37<>\"\"),入力シート!K37,\"\")","v":""},{"$f":"IF(AND(入力シート!$B37<>\"\",入力シート!L37<>\"\"),入力シート!L37,\"\")","v":""},{"$f":"IF(AND(入力シート!$B37<>\"\",入力シート!M37<>\"\"),入力シート!M37,\"\")","v":""},{"$f":"IF(AND(入力シート!$B37<>\"\",入力シート!N37<>\"\"),入力シート!N37,\"\")","v":""},"記入不要",null,null,"記入不要"]
[]
[{"$nulls":47},"部修は記入不要"]
[]
[{"$nulls":22},"カード№","原票区分","訂　正",null,"撤去予定",{"$nulls":3},"営業受付No",{"$nulls":4},"撤去\n設計No",{"$nulls":12},"引込アーム",{"$nulls":4},"HS防護",null,"その他割増","違反件数","インプット\n\nチェック"]
[{"$nulls":48},"本柱材質","種別","長さ","アームタイ"]
[{"$nulls":26},"月",null,"日"]
[]
[{"$nulls":22},14,15,16,17,18,19,20,21,22,23,24,25,26,27,28,29,30,31,32,33,34,35,36,37,38,39,40,41,42,43,44,45,46,47,48]
[{"$nulls":22},{"$f":"IF(入力シート!B44<>\"\",入力シート!B44,\"\")","v":""},4,{"$f":"IF(AND(入力シート!B44<>\"\",入力シート!C44<>\"\"),入力シート!C44,\"\")","v":""},{"$nulls":10},{"$f":"IF(AND(入力シート!$B44<>\"\",入力シート!M44<>\"\"),入力シート!M44,\"\")","v":""},{"$f":"IF(AND(入力シート!$B44<>\"\",入力シート!N44<>\"\"),入力シート!N44,\"\")","v":""},{"$f":"IF(AND(入力シート!$B44<>\"\",入力シート!O44<>\"\"),入力シート!O44,\"\")","v":""},{"$nulls":10},{"$f":"IF(AND(入力シート!$B44,入力シート!P44<>\"\"),入力シート!P44,\"\")","v":""},{"$f":"IF(AND(入力シート!$B44,入力シート!Q44<>\"\"),入力シート!Q44,\"\")","v":""},{"$f":"IF(AND(入力シート!$B44,入力シート!R44<>\"\"),入力シート!R44,\"\")","v":""},{"$f":"IF(AND(入力シート!$B44,入力シート!S44<>\"\"),入力シート!S44,\"\")","v":""},null,{"$f":"IF(AND(入力シート!$B44,入力シート!U44<>\"\"),入力シート!U44,\"\")","v":""},null,{"$f":"IF(AND(入力シート!$B44,入力シート!V44<>\"\"),入力シート!V44,\"\")","v":""},{"$f":"IF(AND(入力シート!$B44,入力シート!W44<>\"\"),入力シート!W44,\"\")","v":""}]
[]
[{"$nulls":26},"部修は記入不要",{"$nulls":8},"部修のみ記入",{"$nulls":8},"道路横断の\n有無",{"$nulls":5},{"$f":"IF(入力シート!O27<>\"\",入力シート!O27,\"\")","v":""}]
[]
[]
[{"$nulls":44},"道路上最低点\n地上高",{"$nulls":5},"設計",{"$nulls":4},"工事後"]
[{"$nulls":51},{"$f":"IF(入力シート!O28<>\"\",入力シート!O28,\"\")","v":""}]
[{"$nulls":54},"ｍ",{"$nulls":4},"ｍ"]
[{"$nulls":44},"径間長",{"$nulls":3},"単独",{"$f":"IF(入力シート!U27<>\"\",入力シート!U27,\"\")","v":""},{"$nulls":3},"ｍ","連接",{"$f":"IF(入力シート!U28<>\"\",入力シート!U28,\"\")","v":""},{"$nulls":3},"ｍ"]
[]
[]
[{"$nulls":40},"自主検査項目",{"$nulls":5},"点検日",null,"年　　　月　　　日",{"$nulls":5},"点検者",{"$nulls":4},"✓"]
[{"$nulls":40},"（工事会社記入欄）"]
[{"$nulls":40},1,"キズまたはキンクのある電線を使用していないか"]
[{"$nulls":40},2,"地表上の高さはよいか"]
[{"$nulls":40},3,"他物との離隔はよいか"]
[{"$nulls":29},"撤去工事完了連絡",{"$nulls":10},4,"電線の接続および接続後の処理はよいか"]
[{"$nulls":29},"工事会社",{"$nulls":10},5,"ち度は規定に適合しているか"]
[{"$nulls":29},"責任者",{"$nulls":10},6,"配色と色別区分はよいか"]
["＜備考＞撤去工事分の「臨時引込線工事設計書」は、新設分記入後の承認書コピーを",{"$nulls":28},"引込線",null,null,"　　　年　　　月　　　日",{"$nulls":7},7,"家屋側支持点・ケーブルの取り付け工事はよいか"]
["　　　　使用することができます。ただし、撤去の設計No．は新設分＋１とします。",{"$nulls":28},"撤去日",{"$nulls":10},8,"資材は、当社指定品を使用しているか"]
[{"$nulls":7},"当社柱",{"$nulls":4},"低圧線",{"$nulls":4},"径間長",{"$nulls":4},"引込線　電灯-単独",{"$nulls":6},"引込線　電灯-メッセン"]
[]
[]
[]
[{"$nulls":7},"変圧器柱",{"$nulls":4},"引込線",{"$nulls":4},"空のテキスト",{"$nulls":4},"引込線　電力-単独",{"$nulls":6},"引込線　電力-メッセン"]
[]
[]
[]
[{"$nulls":7},"ＮＴＴ柱",{"$nulls":4},"メッセンジャー",{"$nulls":4},"お客さま受電柱",{"$nulls":4},"取り外し記号"]

{"sheet":"旧裏面資料","index":4,"n_rows":25,"n_cols":33,"rows_kept":25,"merged":[[2,1,3,2],[2,3,3,4],[2,7,3,14],[2,15,3,16],[2,18,3,19],[2,20,3,21],[2,23,3,24],[2,27,3,28],[2,29,3,30],[4,1,4,2],[4,3,4,4],[4,7,4,14],[4,15,4,16],[4,18,4,19],[4,20,4,21],[4,23,4,24],[4,27,4,28],[4,29,4,30],[5,1,5,2],[5,3,5,4],[5,7,5,14],[5,15,5,16],[5,18,5,19],[5,20,5,21],[5,23,5,24],[5,27,5,28],[5,29,5,30],[6,1,6,2],[6,3,6,4],[6,7,6,14],[6,15,6,16],[6,18,6,19],[6,20,6,21],[6,23,6,24],[6,27,6,28],[6,29,6,30],[7,1,7,2],[7,3,7,4],[7,7,7,14],[7,15,7,16],[7,18,7,19],[7,20,7,21],[7,23,7,24],[7,27,7,28],[7,29,7,30],[8,7,8,14],[8,15,8,16],[8,23,8,24],[9,7,9,14],[9,15,9,16],[9,23,9,24],[10,7,10,14],[10,15,10,16],[10,23,10,24],[11,7,11,14],[11,15,11,16],[11,23,11,24],[12,23,12,24],[13,23,13,24],[16,1,16,15],[16,17,16,29],[17,1,18,3],[17,4,17,15],[17,17,18,19],[17,20,17,29],[18,4,18,7],[18,8,18,11],[18,12,18,15],[18,20,18,24],[18,25,18,29],[19,1,19,3],[19,4,19,7],[19,8,19,11],[19,12,19,15],[19,17,19,19],[19,20,19,24],[19,25,19,29],[20,1,20,3],[20,4,20,7],[20,8,20,11],[20,12,20,15],[20,17,20,19],[20,20,20,24],[20,25,20,29],[21,1,21,3],[21,4,21,7],[21,8,21,11],[21,12,21,15],[21,17,21,19],[21,20,21,24],[21,25,21,29],[22,1,22,3],[22,4,22,7],[22,8,22,11],[22,12,22,15],[22,17,22,19],[22,20,22,24],[22,25,22,29],[23,1,23,3],[23,4,23,7],[23,8,23,11],[23,12,23,15],[23,17,23,19],[23,20,23,24],[23,25,23,29],[24,1,24,3],[24,4,24,7],[24,8,24,11],[24,12,24,15]]}
[]
[null,"カラム26",{"$nulls":5},"カラム29",{"$nulls":10},"カラム31",{"$nulls":4},"カラム34",{"$nulls":3},"カラム38"]
[null,"訂正",null,"記入\n記号",{"$nulls":3},"パターン1",{"$nulls":7},"記入\n記号",null,null,"線種",null,"記入\n記号",null,null,"太さ\n記入",{"$nulls":3},"設計",null,"記入\n記号",null,null,"（注）設計工量の記入"]
[{"$nulls":32},"新設と撤去の設計は同時に行うことから、設計工量は、両方合わせて1口とし、"]
[null,"追加",null,"追",{"$nulls":3},"部分修繕",{"$nulls":7},"部",null,null,"D V",null,"D",null,null,2.6,{"$nulls":3},"要",null,"要",null,null,"新設設計書の方を「要」とする。"]
[null,"置換",null,"置",{"$nulls":3},"単独直接",{"$nulls":7},"単",null,null,"I V",null,"I",null,null,3.2,{"$nulls":3},"不要",null,"不"]
[null,"削除",null,"削",{"$nulls":3},"単独共架小",{"$nulls":7},"小",null,null,"V V",null,"V",{"$nulls":6},"のみ",null,"の"]
[null,"取消",null,"取",{"$nulls":3},"単独共架大",{"$nulls":7},"大",null,null,"S T",null,"S",null,null,8,{"$nulls":3},"メ要",null,"メ"]
[null,"※原票4・カラム16も同様",{"$nulls":5},"連　接",{"$nulls":7},"連",{"$nulls":7},14]
[{"$nulls":7},"屋　側",{"$nulls":7},"屋",{"$nulls":7},22]
[{"$nulls":7},"メッセンジャーケーブル",{"$nulls":7},"メ",{"$nulls":7},38]
[{"$nulls":7},"メッセンジャーワイヤー",{"$nulls":7},"ワ",{"$nulls":7},60]
[{"$nulls":23},80]
[{"$nulls":23},100]
[]
[null,"契約容量における引込線亘長と太さ[標準表]"]
[null,"単独引込線の標準（カッコ内は単三の場合）",{"$nulls":15},"単独引込線の標準　亘長35m以下"]
[null,"電灯契約",null,null,"引込線亘長",{"$nulls":12},"動力契約",null,null,"力率改善コンデンサの有無"]
[{"$nulls":4},"15m以下",{"$nulls":3},"25m以下",{"$nulls":3},"35m以下",{"$nulls":7},"取り付けあり",{"$nulls":4},"取り付けなし"]
[null,"1kVA以下",null,null,"2.6mm(2.6)",{"$nulls":3},"3.2mm(2.6)",{"$nulls":3},"3.2mm(2.6)",{"$nulls":4},"1kVA以下",null,null,"2.6mm",{"$nulls":4},"2.6mm"]
[null,"2kVA以下",null,null,"2.6mm(2.6)",{"$nulls":3},"3.2mm(2.6)",{"$nulls":3},"14mm2(2.6)",{"$nulls":4},"2kVA以下",null,null,"2.6mm",{"$nulls":4},"3.2mm"]
[null,"3kVA以下",null,null,"3.2mm(2.6)",{"$nulls":3},"14mm2(3.2)",{"$nulls":3},"22mm2(3.2)",{"$nulls":4},"3kVA以下",null,null,"3.2mm",{"$nulls":4},"3.2mm"]
[null,"40A以下",null,null,"14mm2(2.6)",{"$nulls":3},"22mm2(3.2)",{"$nulls":3},"38mm2(14)",{"$nulls":4},"40A以下",null,null,"3.2mm",{"$nulls":4},"14mm2"]
[null,"50A以下",null,null,"14mm2(3.2)",{"$nulls":3},"22mm2(14)",{"$nulls":3},"38mm2(14)",{"$nulls":4},"50A以下",null,null,"14mm2",{"$nulls":4},"14mm2"]
[null,"60A以下",null,null,"22mm2(3.2)",{"$nulls":3},"38mm2(14)",{"$nulls":3},"38mm2(22)"]

{"sheet":"動作ログ","index":5,"n_rows":3,"n_cols":7,"rows_kept":3}
["処理年月日","処理時刻","処理結果","備考１","備考２"]
[]
[{"$nulls":6},"\n"]

{"sheet":"改定履歴","index":6,"n_rows":17,"n_cols":3,"rows_kept":17}
["バージョン","更新日","更新内容"]
["1.00",null,"託送Web導入に伴い新規制定"]
["2.00","2020-04-01","様式見直しに伴う改定　引込線工事実施承認書⇒引込線工事設計書"]
[null,null,"引込柱番号・工事会社コードなど数値入力をプルダウンから直接入力へ変更"]
[null,null,"施工情報（道路横断・地上高・径間長）入力欄を新設"]
["2.01","2020-09-04","各種不具合修正"]
[null,null,"原票項目・訂正欄が「追加」表示固定となっていた不具合を修正"]
[null,null,"平面図・図形の変形に制約があったものを修正"]
[null,null,"撤去シートの自主検査欄に取り消し線追加"]
["2.02","2020-10-08","各種不具合修正"]
[null,null,"平面図・テキストボックス内で改行不能となっていた不具合を修正"]
[null,null,"撤去の設計工量が「要」表示固定となっていたものを「不要」へ修正"]
[null,null,"電柱番号入力を各桁独立入力から12桁連続入力へ変更"]
[null,null,"事業所情報の支店ー営業支店間を１セル空けた（プルダウンボタンの隣接セル干渉回避）"]
[null,null,"設計書注記に「実施承認書」の記載が残っていたものを修正"]
["2.03","2020/10","初期化動作の不具合を修正"]
["2.04","2021-09-28","活線雑作業工量を廃止"]

{"sheet":"コード変換","index":7,"n_rows":23,"n_cols":38,"rows_kept":23,"hidden":true,"merged":[[1,13,1,15],[1,16,1,18],[1,20,1,22],[1,23,1,25],[1,27,1,29],[1,30,1,32],[1,34,1,36],[1,37,1,39],[4,13,7,13],[4,14,4,17],[4,18,7,18],[4,19,7,19],[4,20,7,20],[4,21,4,28],[4,29,7,29],[4,30,7,30],[4,31,4,33],[4,34,4,37],[5,14,7,14],[5,15,5,17],[5,21,7,21],[5,22,5,23],[5,24,7,24],[5,25,7,25],[5,26,7,26],[5,27,7,27],[5,28,7,28],[5,31,7,31],[5,32,7,32],[5,33,7,33],[5,34,5,35],[5,36,5,37],[6,15,7,15],[6,16,7,16],[6,17,7,17],[6,23,7,23],[6,34,7,34],[6,35,7,35],[6,36,7,36],[6,37,7,37],[18,13,21,13],[18,14,21,14],[18,15,19,16],[18,17,21,17],[18,18,21,18],[18,19,18,22],[18,23,21,23],[18,24,21,24],[18,25,21,25],[18,26,21,26],[18,27,19,29],[19,19,21,19],[19,20,21,20],[19,21,21,21],[19,22,21,22],[20,15,21,15],[20,16,21,16],[20,27,21,27],[20,28,21,28],[20,29,21,29]]}
[]
[null,"事業所",{"$f":"IF(入力シート!B9<>\"\",VLOOKUP(入力シート!B9,マスタデータ1!C8:AY19,49,FALSE),\"\")","v":""},{"$f":"IF(入力シート!D9<>\"\",入力シート!D9,\"\")","v":""},{"$f":"IF(入力シート!E9<>\"\",入力シート!E9,\"\")","v":""},{"$f":"IF(入力シート!F9<>\"\",入力シート!F9,\"\")","v":""},{"$f":"CONCATENATE(C2,D2,E2,F2)","v":""},{"$nulls":6},"事業所",null,null,{"$f":"G2","v":""},{"$nulls":3},"工事会社",null,null,{"$f":"H4","v":""},{"$nulls":3},"設計書No",null,null,{"$f":"F5","v":""},{"$nulls":3},"NW受付番号"]
[null,"営業所",{"$f":"IF(入力シート!G9<>\"\",入力シート!G9,\"\")","v":""},{"$f":"IF(入力シート!H9<>\"\",入力シート!H9,\"\")","v":""},{"$f":"IF(入力シート!I9<>\"\",入力シート!I9,\"\")","v":0},null,{"$f":"CONCATENATE(C3,D3,E3)","v":"0"}]
[null,"工事会社",{"$f":"IF(入力シート!B11<>\"\",入力シート!B11,\"\")","v":""},{"$f":"IF(入力シート!C11<>\"\",入力シート!C11,\"\")","v":""},{"$f":"IF(入力シート!E11<>\"\",入力シート!E11,\"\")","v":""},{"$f":"IF(入力シート!F11<>\"\",入力シート!F11,\"\")","v":""},{"$f":"IF(入力シート!G11<>\"\",入力シート!G11,\"\")","v":""},{"$f":"CONCATENATE(C4,D4,E4,F4,G4)","v":""},{"$f":"CONCATENATE(C4,D4,\"-\",E4,F4,G4)","v":"-"}]
[null,"設計No",{"$f":"IF(入力シート!B17<>\"\",入力シート!B17,\"\")","v":""},{"$f":"IF(入力シート!C17<>\"\",入力シート!C17,\"\")","v":""},{"$f":"IF(入力シート!D17<>\"\",入力シート!D17,\"\")","v":""},{"$f":"CONCATENATE(C5,D5,E5)","v":""},{"$f":"IF(F5<>\"\",F5+1,\"\")","v":""},{"$f":"IF(LEN(G5)=3,G5,IF(LEN(G5)=2,CONCATENATE(\"0\",G5),IF(LEN(G5)=1,CONCATENATE(\"00\",G5),\"\")))","v":""},{"$nulls":5},"カード№","工事場所",{"$nulls":3},"工事区分","訂　正","付　外","引　込　線",{"$nulls":7},"設計工量","供給KW","引込柱No",null,null,"＜参考＞部修"]
[null,"画",{"$f":"IF(入力シート!I20<>\"\",入力シート!I20,\"\")","v":""},{"$f":"IF(入力シート!J20<>\"\",入力シート!J20,\"\")","v":""},{"$f":"CONCATENATE(C6,D6)","v":""},{"$nulls":9},"営業所","メッシュNo",{"$nulls":5},"灯　力","パターン",null,"条　数","電話防護","太　さ","口　数","総亘長",null,null,"番","の","号","取付",null,"取外"]
[null,"区",{"$f":"IF(入力シート!K20<>\"\",入力シート!K20,\"\")","v":""},{"$f":"IF(入力シート!L20<>\"\",入力シート!L20,\"\")","v":""},{"$f":"CONCATENATE(C7,D7)","v":""},{"$nulls":10},"画","区","図",{"$nulls":4},"方式","線種",{"$nulls":10},"口数","亘長","口数","亘長"]
[null,"図",{"$f":"IF(入力シート!M20<>\"\",入力シート!M20,\"\")","v":""},{"$f":"IF(入力シート!N20<>\"\",入力シート!N20,\"\")","v":""},"",{"$nulls":17},1]
[null,"引番",{"$f":"IF(入力シート!O20<>\"\",入力シート!O20,\"\")","v":""},{"$f":"IF(入力シート!P20<>\"\",入力シート!P20,\"\")","v":""},"",{"$nulls":8},{"$f":"IF(入力シート!B35<>\"\",入力シート!B35,\"\")","v":""},{"$f":"G3","v":"0"},{"$f":"E6","v":""},{"$f":"E7","v":""},{"$f":"E8","v":""},null,{"$f":"IF(AND(入力シート!B35<>\"\",入力シート!C35<>\"\"),1,\"\")","v":""},{"$f":"IF(AND(入力シート!$B35<>\"\",入力シート!$D35<>\"\"),VLOOKUP(入力シート!$D35,マスタデータ1!AC$8:$AY$19,23,FALSE),\"\")","v":""},{"$f":"IF(AND(入力シート!$B35<>\"\",入力シート!$E35<>\"\"),VLOOKUP(入力シート!$E35,マスタデータ1!AD$8:$AY$19,22,FALSE),\"\")","v":""},{"$f":"IF(AND(入力シート!$B35<>\"\",入力シート!$F35<>\"\"),VLOOKUP(入力シート!$F35,マスタデータ1!AE$8:$AY$19,21,FALSE),\"\")","v":""},{"$f":"IF(AND(入力シート!$B35<>\"\",入力シート!$G35<>\"\"),VLOOKUP(入力シート!$G35,マスタデータ1!AG$8:$AY$19,19,FALSE),\"\")","v":""},{"$f":"IF(AND(入力シート!$B35<>\"\",入力シート!$H35<>\"\"),VLOOKUP(入力シート!$H35,マスタデータ1!AH$8:$AY$19,18,FALSE),\"\")","v":""},{"$f":"IF(AND(入力シート!$B35<>\"\",入力シート!$I35<>\"\"),VLOOKUP(入力シート!$I35,マスタデータ1!AI$8:$AY$19,17,FALSE),\"\")","v":""},{"$f":"IF(AND(入力シート!$B35<>\"\",入力シート!$J35<>\"\"),VLOOKUP(入力シート!$J35,マスタデータ1!AJ$8:$AY$19,16,FALSE),\"\")","v":""},{"$f":"IF(AND(入力シート!$B35<>\"\",入力シート!$K35<>\"\"),VLOOKUP(入力シート!$K35,マスタデータ1!AK$8:$AY$19,15,FALSE),\"\")","v":""},{"$f":"E15","v":""},{"$f":"IF(AND(入力シート!$B35<>\"\",入力シート!$N35<>\"\"),VLOOKUP(入力シート!$N35,マスタデータ1!AN$8:$AY$19,12,FALSE),\"\")","v":""},{"$f":"F18","v":""},{"$f":"E9","v":""},{"$f":"E10","v":""},{"$f":"E11","v":""}]
[null,"引の",{"$f":"IF(入力シート!Q20<>\"\",入力シート!Q20,\"\")","v":""},{"$f":"IF(入力シート!R20<>\"\",入力シート!R20,\"\")","v":""},"",{"$nulls":8},{"$f":"IF(入力シート!B36<>\"\",入力シート!B36,\"\")","v":""},{"$nulls":5},{"$f":"IF(AND(入力シート!B36<>\"\",入力シート!C36<>\"\"),1,\"\")","v":""},{"$f":"IF(AND(入力シート!$B36<>\"\",入力シート!$D36<>\"\"),VLOOKUP(入力シート!$D36,マスタデータ1!AC$8:$AY$19,23,FALSE),\"\")","v":""},{"$f":"IF(AND(入力シート!$B36<>\"\",入力シート!$E36<>\"\"),VLOOKUP(入力シート!$E36,マスタデータ1!AD$8:$AY$19,22,FALSE),\"\")","v":""},{"$f":"IF(AND(入力シート!$B36<>\"\",入力シート!$F36<>\"\"),VLOOKUP(入力シート!$F36,マスタデータ1!AE$8:$AY$19,21,FALSE),\"\")","v":""},{"$f":"IF(AND(入力シート!$B36<>\"\",入力シート!$G36<>\"\"),VLOOKUP(入力シート!$G36,マスタデータ1!AG$8:$AY$19,19,FALSE),\"\")","v":""},{"$f":"IF(AND(入力シート!$B36<>\"\",入力シート!$H36<>\"\"),VLOOKUP(入力シート!$H36,マスタデータ1!AH$8:$AY$19,18,FALSE),\"\")","v":""},{"$f":"IF(AND(入力シート!$B36<>\"\",入力シート!$I36<>\"\"),VLOOKUP(入力シート!$I36,マスタデータ1!AI$8:$AY$19,17,FALSE),\"\")","v":""},{"$f":"IF(AND(入力シート!$B36<>\"\",入力シート!$J36<>\"\"),VLOOKUP(入力シート!$J36,マスタデータ1!AJ$8:$AY$19,16,FALSE),\"\")","v":""},{"$f":"IF(AND(入力シート!$B36<>\"\",入力シート!$K36<>\"\"),VLOOKUP(入力シート!$K36,マスタデータ1!AK$8:$AY$19,15,FALSE),\"\")","v":""},{"$f":"IF(AND(N10<>\"\",E16<>\"\"),E16,\"\")","v":""},{"$f":"IF(AND(入力シート!$B36<>\"\",入力シート!$N36<>\"\"),VLOOKUP(入力シート!$N36,マスタデータ1!AN$8:$AY$19,12,FALSE),\"\")","v":""}]
[null,"引号",{"$f":"IF(入力シート!S20<>\"\",入力シート!S20,\"\")","v":""},{"$f":"IF(入力シート!T20<>\"\",入力シート!T20,\"\")","v":""},"",{"$nulls":8},{"$f":"IF(入力シート!B37<>\"\",入力シート!B37,\"\")","v":""},{"$nulls":5},{"$f":"IF(AND(入力シート!B37<>\"\",入力シート!C37<>\"\"),1,\"\")","v":""},{"$f":"IF(AND(入力シート!$B37<>\"\",入力シート!$D37<>\"\"),VLOOKUP(入力シート!$D37,マスタデータ1!AC$8:$AY$19,23,FALSE),\"\")","v":""},{"$f":"IF(AND(入力シート!$B37<>\"\",入力シート!$E37<>\"\"),VLOOKUP(入力シート!$E37,マスタデータ1!AD$8:$AY$19,22,FALSE),\"\")","v":""},{"$f":"IF(AND(入力シート!$B37<>\"\",入力シート!$F37<>\"\"),VLOOKUP(入力シート!$F37,マスタデータ1!AE$8:$AY$19,21,FALSE),\"\")","v":""},{"$f":"IF(AND(入力シート!$B37<>\"\",入力シート!$G37<>\"\"),VLOOKUP(入力シート!$G37,マスタデータ1!AG$8:$AY$19,19,FALSE),\"\")","v":""},{"$f":"IF(AND(入力シート!$B37<>\"\",入力シート!$H37<>\"\"),VLOOKUP(入力シート!$H37,マスタデータ1!AH$8:$AY$19,18,FALSE),\"\")","v":""},{"$f":"IF(AND(入力シート!$B37<>\"\",入力シート!$I37<>\"\"),VLOOKUP(入力シート!$I37,マスタデータ1!AI$8:$AY$19,17,FALSE),\"\")","v":""},{"$f":"IF(AND(入力シート!$B37<>\"\",入力シート!$J37<>\"\"),VLOOKUP(入力シート!$J37,マスタデータ1!AJ$8:$AY$19,16,FALSE),\"\")","v":""},{"$f":"IF(AND(入力シート!$B37<>\"\",入力シート!$K37<>\"\"),VLOOKUP(入力シート!$K37,マスタデータ1!AK$8:$AY$19,15,FALSE),\"\")","v":""},{"$f":"IF(AND(N11<>\"\",E17<>\"\"),E17,\"\")","v":""},{"$f":"IF(AND(入力シート!$B37<>\"\",入力シート!$N37<>\"\"),VLOOKUP(入力シート!$N37,マスタデータ1!AN$8:$AY$19,12,FALSE),\"\")","v":""}]
[null,"変番",{"$f":"IF(入力シート!H22<>\"\",入力シート!H22,\"\")","v":""},{"$f":"IF(入力シート!I22<>\"\",入力シート!I22,\"\")","v":""},""]
[null,"変の",{"$f":"IF(入力シート!J22<>\"\",入力シート!J22,\"\")","v":""},{"$f":"IF(入力シート!K22<>\"\",入力シート!K22,\"\")","v":""},""]
[null,"変号",{"$f":"IF(入力シート!L22<>\"\",入力シート!L22,\"\")","v":""},{"$f":"IF(入力シート!M22<>\"\",入力シート!M22,\"\")","v":""},""]
[null,"総亘長1",{"$f":"IF(入力シート!L35<>\"\",入力シート!L35,\"\")","v":""},{"$f":"IF(入力シート!M35<>\"\",入力シート!M35,\"\")","v":""},""]
[null,"総亘長2",{"$f":"IF(入力シート!L36<>\"\",入力シート!L36,\"\")","v":""},{"$f":"IF(入力シート!M36<>\"\",入力シート!M36,\"\")","v":""},""]
[null,"総亘長3",{"$f":"IF(入力シート!L37<>\"\",入力シート!L37,\"\")","v":""},{"$f":"IF(入力シート!M37<>\"\",入力シート!M37,\"\")","v":""},""]
[null,"供給KW",{"$f":"IF(入力シート!O35<>\"\",入力シート!O35,\"\")","v":""},{"$f":"IF(入力シート!P35<>\"\",入力シート!P35,\"\")","v":""},{"$f":"IF(入力シート!Q35<>\"\",入力シート!Q35,\"\")","v":""},{"$f":"CONCATENATE(C18,D18,E18)","v":""}]
[null,"撤去予定月",{"$f":"IF(入力シート!D44<>\"\",入力シート!D44,\"\")","v":""},{"$f":"IF(入力シート!E44<>\"\",入力シート!E44,\"\")","v":""},{"$f":"CONCATENATE(C19,D19)","v":""},{"$nulls":8},"カード№","訂　正","撤去予定",null,"営業受付No","撤去設計No","引込アーム",{"$nulls":3},"（廃止）","HS防護","その他割","違反件数","撤去予定"]
[null,"撤去予定日",{"$f":"IF(入力シート!F44<>\"\",入力シート!F44,\"\")","v":""},{"$f":"IF(入力シート!G44<>\"\",入力シート!G44,\"\")","v":""},{"$f":"CONCATENATE(C20,D20)","v":""},{"$nulls":14},"本柱材","種別","長さ","タイ"]
[null,"営業受付No",{"$f":"IF(入力シート!H44<>\"\",入力シート!H44,\"\")","v":""},{"$f":"IF(入力シート!I44<>\"\",入力シート!I44,\"\")","v":""},{"$f":"IF(入力シート!J44<>\"\",入力シート!J44,\"\")","v":""},{"$f":"IF(入力シート!K44<>\"\",入力シート!K44,\"\")","v":""},{"$f":"IF(入力シート!L44<>\"\",入力シート!L44,\"\")","v":""},{"$f":"CONCATENATE(C21,D21,E21,F21,G21)","v":""},{"$nulls":7},"月","日",{"$nulls":10},"年","月","日"]
[null,"撤去設計No",{"$f":"IF(入力シート!M44<>\"\",入力シート!M44,\"\")","v":""},{"$f":"IF(入力シート!N44<>\"\",入力シート!N44,\"\")","v":""},{"$f":"IF(入力シート!O44<>\"\",入力シート!O44,\"\")","v":""},{"$f":"CONCATENATE(C22,D22,E22)","v":""}]
[{"$nulls":13},{"$f":"IF(入力シート!B44<>\"\",入力シート!B44,\"\")","v":""},{"$f":"IF(AND(入力シート!B44<>\"\",入力シート!C44<>\"\"),1,\"\")","v":""},{"$f":"IF(入力シート!B44<>\"\",E19,\"\")","v":""},{"$f":"IF(入力シート!B44<>\"\",E20,\"\")","v":""},{"$f":"IF(入力シート!B44<>\"\",H21,\"\")","v":""},{"$f":"IF(入力シート!B44<>\"\",F22,\"\")","v":""},{"$f":"IF(AND(入力シート!$B$44<>\"\",入力シート!P44<>\"\"),VLOOKUP(入力シート!P44,マスタデータ1!AP27:$AY$36,10,FALSE),\"\")","v":""},{"$f":"IF(AND(入力シート!$B$44<>\"\",入力シート!Q44<>\"\"),VLOOKUP(入力シート!Q44,マスタデータ1!AQ27:$AY$36,9,FALSE),\"\")","v":""},{"$f":"IF(AND(入力シート!$B$44<>\"\",入力シート!R44<>\"\"),VLOOKUP(入力シート!R44,マスタデータ1!AR27:$AY$36,8,FALSE),\"\")","v":""},{"$f":"IF(AND(入力シート!$B$44<>\"\",入力シート!S44<>\"\"),VLOOKUP(入力シート!S44,マスタデータ1!AS27:$AY$36,7,FALSE),\"\")","v":""},null,{"$f":"IF(AND(入力シート!$B$44<>\"\",入力シート!U44<>\"\"),VLOOKUP(入力シート!U44,マスタデータ1!AU27:$AY$36,5,FALSE),\"\")","v":""},{"$f":"IF(AND(入力シート!$B$44<>\"\",入力シート!V44<>\"\"),VLOOKUP(入力シート!V44,マスタデータ1!AW27:$AY$36,3,FALSE),\"\")","v":""},{"$f":"IF(AND(入力シート!$B$44<>\"\",入力シート!W44<>\"\"),VLOOKUP(入力シート!W44,マスタデータ1!AX27:$AY$36,2,FALSE),\"\")","v":""}]

{"sheet":"関連項目チェック一覧","index":8,"n_rows":24,"n_cols":18,"rows_kept":24,"hidden":true,"merged":[[3,0,3,5],[3,6,3,11],[3,13,3,15],[3,16,3,17],[5,5,6,5],[8,5,10,5],[8,12,10,12],[12,5,13,5],[12,12,13,12],[15,5,19,5],[15,12,19,12],[21,5,23,5],[21,12,23,12]]}
[]
["組合せチェック一覧"]
[]
["関連チェック詳細",{"$nulls":5},"入力許可",{"$nulls":5},"出力メッセージ","RPA変換シート",null,null,"入力シート"]
["項目\n種別","原票区分","チェック種別","項目\n分類","チェック項目","表示メッセージ","前提条件","英字","数字(離散値)","数字(連続値)","スペース","全て","メッセージ（※未使用項目）","対応行","対応列","対応\n桁位置","対応行","対応列"]
["01","0","必須関連チェック","01","電灯申込（定額）","・申込情報の電灯、動力は合計0以上の数値を入力してください。",{"$nulls":3},"*",null,null,"申込情報エラー","-","-","-","24","4"]
["01","0","必須関連チェック","01","電力申込（従量）",{"$nulls":4},"*",null,null,"申込情報エラー","-","-","-","24","11"]
[]
["31","3","関連チェック","01","カードNo.","・カードNo.1で引込線・方式1が“部”以外の場合、供給KWは必須入力です。","○",null,"1",{"$nulls":3},"供給ＫＷ記入エラー","9","14","-","35","2"]
["31","3","関連チェック","01","引込線・方式1",null,"○",null,"8,9","1-5",{"$nulls":3},"9","23","-","35","6"]
["31","3","関連チェック","01","供給KW",{"$nulls":4},"000-999",{"$nulls":3},"9","31","-","35","15,16,17"]
[]
["41","4","日付チェック","01","撤去予定日（月）","・撤去予定日に存在しない日付が入力されています。",{"$nulls":3},"*",null,null,"撤去予定日エラー","23","16","-","44","4,5"]
["41","4","日付チェック","01","撤去予定日（日）",{"$nulls":4},"*",{"$nulls":3},"23","17","-","44","6,7"]
[]
["41","4","関連チェック","01","営業受付No","・営業受付Noには００００１～９９９９９を入力してください。","○",null,null,"0",null,null,"営業受付Noエラー","23","18","1","44","8"]
["41","4","関連チェック","01","営業受付No",null,"○",null,null,"0",{"$nulls":3},"23","18","2","44","9"]
["41","4","関連チェック","01","営業受付No",null,"○",null,null,"0",{"$nulls":3},"23","18","3","44","10"]
["41","4","関連チェック","01","営業受付No",null,"○",null,null,"0",{"$nulls":3},"23","18","4","44","11"]
["41","4","関連チェック","01","営業受付No",{"$nulls":4},"1-9",{"$nulls":3},"23","18","5","44","12"]
[]
["41","4","関連チェック","01","撤去設計No","・撤去設計Noには００１～９９９を入力してください。","○",null,null,"0",null,null,"撤去設計Noエラー","23","19","1","44","13"]
["41","4","関連チェック","01","撤去設計No",null,"○",null,null,"0",{"$nulls":3},"23","19","2","44","14"]
["41","4","関連チェック","01","撤去設計No",{"$nulls":4},"1-9",{"$nulls":3},"23","19","3","44","15"]

{"sheet":"単項目チェック一覧","index":9,"n_rows":79,"n_cols":18,"rows_kept":79,"hidden":true,"merged":[[3,0,3,5],[3,6,3,11],[3,13,3,15],[3,16,3,17]]}
[]
["単項目チェック一覧"]
[]
["単項目チェック詳細",{"$nulls":5},"入力許可",{"$nulls":5},"出力メッセージ","RPA変換シート",null,null,"入力シート"]
["項目\n種別","原票区分","チェック種別","項目\n分類","チェック項目","表示メッセージ","必須","英字","数字(離散値)","数字(連続値)","スペース","全て","メッセージ（※未使用項目）","対応行","対応列","対応\n桁位置","対応行","対応列"]
["31","0","単体チェック","01","・需要場所住所",null,"○",{"$nulls":4},"○","申込者情報エラー","-","-","-","4","2"]
["31","0","単体チェック","01","・目標",{"$nulls":6},"○","申込者情報エラー","-","-","-","5","2"]
["31","0","単体チェック","01","・契約者名",null,"○",{"$nulls":4},"○","申込者情報エラー","-","-","-","6","2"]
["31","0","単体チェック","01","・支店","２～６以外","○",null,null,"2-6",null,null,"事業所エラー","2","17","1","9","2"]
["31","0","単体チェック","01","・営業支店","１，３，５以外","○",null,"1,3,5",{"$nulls":3},"事業所エラー","2","17","2","9","4"]
["31","0","単体チェック","01","・営業所","０～９以外","○",null,null,"0-9",null,null,"事業所エラー","2","17","3","9","5"]
["31","0","単体チェック","01","・グループ","０～４以外","○",null,null,"0-4",null,null,"事業所エラー","2","17","4","9","6"]
["11","3","単体チェック","01","・営業所1桁目","０～２、またはスペース以外","○",null,null,"0-2","○",null,"工事場所（営業所エラー）","9","15","1","9","7"]
["11","3","単体チェック","01","・営業所2桁目","０，１，３，５，７，９またはスペース以外","○",null,"0,1,3,5,7,9",null,"○",null,"工事場所（営業所エラー）","9","15","2","9","8"]
["11","3","単体チェック","01","・営業所3桁目","０またはスペース以外","○",null,"0",null,"○",null,"工事場所（営業所エラー）","9","15","3","9","9"]
["31","0","単体チェック","01","・内線工事会社1桁目","B,C,D,E,F以外","○","B,C,D,E,F",{"$nulls":4},"工事会社コードエラー","2","24","1","11","2"]
["31","0","単体チェック","01","・内線工事会社2桁目","１～４以外","○",null,null,"1-4",null,null,"工事会社コードエラー","2","24","2","11","3"]
["31","0","単体チェック","01","・内線工事会社4桁目","０～９以外","○",null,null,"0-9",null,null,"工事会社コードエラー","2","24","3","11","5"]
["31","0","単体チェック","01","・内線工事会社5桁目","０～９以外","○",null,null,"0-9",null,null,"工事会社コードエラー","2","24","4","11","6"]
["31","0","単体チェック","01","・内線工事会社6桁目","０～９以外","○",null,null,"0-9",null,null,"工事会社コードエラー","2","24","5","11","7"]
["31","0","単体チェック","01","・工事会社名",null,"○",{"$nulls":4},"○","申込者情報エラー","-","-","-","13","2"]
["31","0","単体チェック","01","・工事設計者",null,"○",{"$nulls":4},"○","申込者情報エラー","-","-","-","15","2"]
["31","0","単体チェック","01","・設計書№1桁目","０～９以外","○",null,null,"0-9",null,null,"設計書№エラー","2","31","1","17","2"]
["31","0","単体チェック","01","・設計書№2桁目","０～９以外","○",null,null,"0-9",null,null,"設計書№エラー","2","31","2","17","3"]
["31","0","単体チェック","01","・設計書№3桁目","０～９以外","○",null,null,"0-9",null,null,"設計書№エラー","2","31","3","17","4"]
["31","3","単体チェック","02","・引込柱（画）1桁目","２～８またはスペース以外","○",null,null,"2-8","○",null,"工事場所（メッシュ№エラー）","9","16","1","20","9"]
["31","3","単体チェック","02","・引込柱（画）2桁目","０～５，９またはスペース以外","○",null,"9","0-5","○",null,"工事場所（メッシュ№エラー）","9","16","2","20","10"]
["31","3","単体チェック","02","・引込柱（区）1桁目","０～７またはスペース以外","○",null,null,"0-7","○",null,"工事場所（メッシュ№エラー）","9","17","1","20","11"]
["31","3","単体チェック","02","・引込柱（区）2桁目","０～７またはスペース以外","○",null,null,"0-7","○",null,"工事場所（メッシュ№エラー）","9","17","2","20","12"]
["31","3","単体チェック","02","・引込柱（図）1桁目","０～９またはスペース以外","○",null,null,"0-9","○",null,"工事場所（メッシュ№エラー）","9","18","1","20","13"]
["31","3","単体チェック","02","・引込柱（図）2桁目","０～９またはスペース以外","○",null,null,"0-9","○",null,"工事場所（メッシュ№エラー）","9","18","2","20","14"]
["31","0","単体チェック","01","・引込柱（番）1桁目","０～９以外","○",null,null,"0-9","○",null,"工事場所（メッシュ№エラー）","9","32","1","20","15"]
["31","0","単体チェック","01","・引込柱（番）2桁目","０～９以外","○",null,null,"0-9","○",null,"工事場所（メッシュ№エラー）","9","32","2","20","16"]
["31","0","単体チェック","01","・引込柱（の）1桁目","０～９以外","○",null,null,"0-9","○",null,"工事場所（メッシュ№エラー）","9","33","1","20","17"]
["31","0","単体チェック","01","・引込柱（の）2桁目","０～９以外","○",null,null,"0-9","○",null,"工事場所（メッシュ№エラー）","9","33","2","20","18"]
["31","0","単体チェック","01","・引込柱（号）1桁目","０～９以外","○",null,null,"0-9","○",null,"工事場所（メッシュ№エラー）","9","34","1","20","19"]
["31","0","単体チェック","01","・引込柱（号）2桁目","０～９以外","○",null,null,"0-9","○",null,"工事場所（メッシュ№エラー）","9","34","2","20","20"]
["31","3","単体チェック","02","・変圧器柱（画）1桁目","２～８またはスペース以外",{"$nulls":3},"2-8","○","○","工事場所（メッシュ№エラー）","-","-","-","22","2"]
["31","3","単体チェック","02","・変圧器柱（画）2桁目","０～５，９またはスペース以外",null,null,"9","0-5","○","○","工事場所（メッシュ№エラー）","-","-","-","22","3"]
["31","3","単体チェック","02","・変圧器柱（区）1桁目","０～７またはスペース以外",{"$nulls":3},"0-7","○","○","工事場所（メッシュ№エラー）","-","-","-","22","4"]
["31","3","単体チェック","02","・変圧器柱（区）2桁目","０～７またはスペース以外",{"$nulls":3},"0-7","○","○","工事場所（メッシュ№エラー）","-","-","-","22","5"]
["31","3","単体チェック","02","・変圧器柱（図）1桁目","０～９またはスペース以外",{"$nulls":3},"0-9","○","○","工事場所（メッシュ№エラー）","-","-","-","22","6"]
["31","3","単体チェック","02","・変圧器柱（図）2桁目","０～９またはスペース以外",{"$nulls":3},"0-9","○","○","工事場所（メッシュ№エラー）","-","-","-","22","7"]
["31","0","単体チェック","01","・変圧器柱（番）1桁目","０～９以外",{"$nulls":3},"0-9","○","○","工事場所（メッシュ№エラー）","-","-","-","22","8"]
["31","0","単体チェック","01","・変圧器柱（番）2桁目","０～９以外",{"$nulls":3},"0-9","○","○","工事場所（メッシュ№エラー）","-","-","-","22","9"]
["31","0","単体チェック","01","・変圧器柱（の）1桁目","０～９以外",{"$nulls":3},"0-9","○","○","工事場所（メッシュ№エラー）","-","-","-","22","10"]
["31","0","単体チェック","01","・変圧器柱（の）2桁目","０～９以外",{"$nulls":3},"0-9","○","○","工事場所（メッシュ№エラー）","-","-","-","22","11"]
["31","0","単体チェック","01","・変圧器柱（号）1桁目","０～９以外",{"$nulls":3},"0-9","○","○","工事場所（メッシュ№エラー）","-","-","-","22","12"]
["31","0","単体チェック","01","・変圧器柱（号）2桁目","０～９以外",{"$nulls":3},"0-9","○","○","工事場所（メッシュ№エラー）","-","-","-","22","13"]
["31","0","単体チェック","01","・変圧器容量","リスト項目またはスペース以外",null,null,"357]|[1235][0]|7[5]|1[0][0",null,"○",null,"変圧器容量エラー","-","-","-","22","16"]
["31","0","単体チェック","01","・申込情報（電灯容量）","数値またはスペース以外",{"$nulls":3},"*","○",null,"申込情報エラー","-","-","-","24","4"]
["31","0","単体チェック","01","・申込情報（電灯単位）","KVA,A以外","○","A,KVA",{"$nulls":3},"○","申込情報エラー","-","-","-","24","6"]
["31","0","単体チェック","01","・申込情報（電力容量）","数値またはスペース以外",{"$nulls":3},"*","○",null,"申込情報エラー","-","-","-","24","11"]
["31","0","単体チェック","01","・カード枚数（原票区分3）","１～３以外","○",null,null,"1-3",null,null,"カード枚数エラー","-","-","-","28","2"]
["31","3","単体チェック","03","・訂正区分","１～４またはスペース以外",{"$nulls":3},"1-4","○",null,"訂正区分エラー","9","20","-","35","3"]
["31","3","単体チェック","04","・付外区分","１～２またはスペース以外",{"$nulls":3},"1-2","○",null,"付外区分エラー","9","21","-","35","4"]
["31","3","単体チェック","05","・引込線・灯力区分","１～２またはスペース以外","○",null,null,"1-2","○",null,"灯力区分エラー","9","22","-","35","5"]
["31","3","単体チェック","06","・引込線・方式1","０～５，８，９またはスペース以外",null,null,"8,9","0-5","○",null,"パターンエラー","9","23","-","35","6"]
["31","3","単体チェック","07","・引込線・線種","１，２，４，５またはスペース以外",null,null,"1,2,4,5",null,"○",null,"パターンエラー","9","24","-","35","7"]
["31","3","単体チェック","08","・引込線・条数","１～３またはスペース以外",{"$nulls":3},"1-3","○",null,"条数エラー","9","25","-","35","8"]
["31","3","単体チェック","09","・引込線・電話防護","１～９またはスペース以外",{"$nulls":3},"1-9","○",null,"電話防護エラー","9","26","-","35","9"]
["31","3","単体チェック","10","・引込線・太さ","Ｂ，０、２～９またはスペース以外",null,"B","0","2-9","○",null,"引込線・太さエラー","9","27","-","35","10"]
["31","3","単体チェック","11","・引込線・口数","１～９またはスペース以外","○",null,null,"1-9","○",null,"引込線・口数エラー","9","28","-","35","11"]
["31","3","単体チェック","12","・引込線・総亘長","００～９９またはスペース以外",{"$nulls":3},"00-99","○",null,"引込線・総亘長エラー","9","29","-","35","12,13"]
["31","3","単体チェック","13","・設計工量","１～４またはスペース以外",{"$nulls":3},"1-4","○",null,"設計工量エラー","9","30","-","35","14"]
["31","3","単体チェック","14","・供給ＫＷ","０００～９９９またはスペース以外",{"$nulls":3},"000-999","○",null,"供給ＫＷエラー","9","31","-","35","15,16,17"]
["41","4","単体チェック","01","・訂正区分","０～３またはスペース以外",{"$nulls":3},"0-3","○",null,"訂正区分エラー","9","20","-","35","3"]
["41","4","単体チェック","02","・撤去予定日（月）","０１～１２またはスペース以外",{"$nulls":3},"00-19","○",null,"撤去予定日エラー","23","16","-","44","4,5"]
["41","4","単体チェック","02","・撤去予定日（日）","０１～３１またはスペース以外",{"$nulls":3},"00-39","○",null,"撤去予定日エラー","23","17","-","44","6,7"]
["41","4","単体チェック","03","・営業受付No","００００１～９９９９９またはスペース以外",{"$nulls":3},"00000-99999","○",null,"受付№エラー","23","18","-","44","8,9,10,11,12"]
["41","4","単体チェック","04","・撤去設計","００１～９９９またはスペース以外",{"$nulls":3},"000-999","○",null,"撤去設計№エラー","23","19","-","44","13,14,15"]
["41","4","単体チェック","05","・引込アーム・本柱材質","１～３またはスペース以外",{"$nulls":3},"1-3","○",null,"引込アームエラー","23","20","-","44","16"]
["41","4","単体チェック","06","・引込アーム・種別","１～４またはスペース以外",{"$nulls":3},"1-4","○",null,"引込アームエラー","23","21","-","44","17"]
["41","4","単体チェック","07","・引込アーム・長さ","１～４またはスペース以外",{"$nulls":3},"1-4","○",null,"引込アームエラー","23","22","-","44","18"]
["41","4","単体チェック","08","・引込アーム・アームタイ","１，２またはスペース以外",null,null,"1,2",null,"○",null,"引込アームエラー","23","23","-","44","19"]
["41","4","単体チェック","09","・活線雑作業","１～９またはスペース以外",{"$nulls":3},"1-9","○",null,"活線雑作業エラー","23","24","-","44","20"]
["41","4","単体チェック","10","・ＨＳ防護","０～９またはスペース以外",{"$nulls":3},"0-9","○",null,"ＨＳ防護エラー","23","25","-","44","21"]
["41","4","単体チェック","11","・その他割増","１～５またはスペース以外",{"$nulls":3},"1-5","○",null,"その他割増エラー","23","26","-","44","22"]
["41","4","単体チェック","12","・違反件数","１～９またはスペース以外",{"$nulls":3},"1-9","○",null,"違反件数エラー","23","27","-","44","23"]

{"sheet":"単結図","index":10,"n_rows":0,"n_cols":0,"rows_kept":0,"hidden":true}

{"sheet":"平面図","index":11,"n_rows":0,"n_cols":0,"rows_kept":0,"hidden":true}

{"sheet":"マスタデータ1","index":12,"n_rows":36,"n_cols":51,"rows_kept":36,"hidden":true,"merged":[[2,1,6,1],[2,2,2,5],[2,6,5,11],[2,12,5,14],[2,15,5,15],[2,16,5,16],[2,17,2,25],[2,26,5,26],[2,27,5,27],[2,28,5,28],[2,29,2,38],[2,39,5,39],[2,40,5,42],[2,43,3,48],[2,49,5,49],[2,50,6,50],[3,2,5,2],[3,3,5,3],[3,4,5,4],[3,5,5,5],[3,17,5,19],[3,20,3,25],[3,29,5,29],[3,30,3,32],[3,33,5,33],[3,34,5,34],[3,35,5,35],[3,36,5,36],[3,37,5,38],[4,20,5,21],[4,22,5,23],[4,24,5,25],[4,30,4,31],[4,32,5,32],[4,43,5,44],[4,45,5,46],[4,47,5,48],[21,14,25,14],[21,15,24,15],[21,16,24,16],[21,17,24,17],[21,18,24,18],[21,19,22,22],[21,23,24,27],[21,28,24,30],[21,31,24,40],[21,41,21,44],[21,45,24,45],[21,46,24,46],[21,47,24,47],[21,48,24,48],[21,49,24,49],[21,50,25,50],[22,41,24,41],[22,42,24,42],[22,43,24,43],[22,44,24,44],[23,19,24,20],[23,21,24,22]]}
[]
[null,null,"臨時　原票区分３"]
[null,"RPA\nCD","事業所",{"$nulls":3},"工事会社",{"$nulls":5},"設計書No",null,null,"カード№","原票区分",{"$nulls":9},"工事区分","訂　正","付　外","引　込　線",{"$nulls":9},"設計工量","供給\nKW\n（100W）",null,null,"引込柱No",{"$nulls":6},"RPA\nCD"]
[null,null,"支店","営業支店","営業所","グループ",{"$nulls":11},"営業所",null,null,"メッシュNo",{"$nulls":8},"灯　力","パターン",null,null,"条　数","電話防護","太　さ","口　数","線亘長"]
[{"$nulls":20},"画",null,"区",null,"図",{"$nulls":5},"方式",null,"線種",{"$nulls":10},"番",null,"の",null,"号"]
[{"$nulls":30},1]
[null,null,1,2,3,4,5,6,7,8,9,10,11,12,13,14,15,16,17,18,19,20,21,22,23,24,25,26,27,28,29,30,31,32,33,34,35,36,37,38,39,40,41,42,43,44,45,46,47,48]
[null,"A",{"$nulls":48},"A"]
[null,"B",{"$nulls":33},2.6,{"$nulls":14},"B"]
[null,0,null,null,0,0,{"$nulls":3},0,0,0,0,0,0,null,null,0,0,0,null,0,0,0,0,0,{"$nulls":4},"部",{"$nulls":4},3.2,null,0,0,null,0,0,0,0,0,0,0,0,0,null,0]
[null,1,null,1,1,1,null,1,null,1,1,1,1,1,"1",1,null,1,1,null,null,1,1,1,1,1,null,"追","取付","電灯","単",null,"D",1,1,null,1,1,1,"要",1,1,1,1,1,1,1,1,1,null,1]
[null,2,"旭川",null,2,2,"B",2,null,2,2,2,2,2,2,2,null,2,null,null,2,2,2,2,2,2,"臨時","置","取外","動力","小",null,"I",2,2,"5.5",2,2,2,"不",2,2,2,2,2,2,2,2,2,null,2]
[null,3,"札幌",3,3,3,"C",3,null,3,3,3,3,3,3,3,3,null,3,null,3,3,3,3,3,3,null,"削",null,null,"大",null,null,3,3,8,3,3,3,"の",3,3,3,3,3,3,3,3,3,null,3]
[null,4,"釧路",null,4,4,"D",4,null,4,4,4,4,4,4,4,{"$nulls":4},4,4,4,4,4,4,null,"取",null,null,"連",null,"V",null,4,14,4,4,4,"メ",4,4,4,4,4,4,4,4,4,null,4]
[null,5,"室蘭",5,5,null,"E",null,null,5,5,5,5,5,5,5,null,null,5,null,5,5,5,5,5,5,{"$nulls":4},"屋",null,"S",null,5,22,5,5,5,null,5,5,5,5,5,5,5,5,5,null,5]
[null,6,"函館",null,6,null,"F",null,null,6,6,6,6,6,6,6,{"$nulls":4},"6",null,6,6,6,6,{"$nulls":8},6,38,6,6,6,null,6,6,6,6,6,6,6,6,6,null,6]
[null,7,null,null,7,{"$nulls":4},7,7,7,7,7,7,7,null,null,7,null,7,null,7,7,7,7,{"$nulls":8},7,60,7,7,7,null,7,7,7,7,7,7,7,7,7,null,7]
[null,8,null,null,8,{"$nulls":4},8,8,8,8,8,8,8,{"$nulls":4},8,{"$nulls":3},8,8,{"$nulls":4},"メ",{"$nulls":3},8,80,8,8,8,null,8,8,8,8,8,8,8,8,8,null,8]
[null,9,null,null,9,{"$nulls":4},9,9,9,9,9,9,9,null,null,9,null,null,9,null,null,9,9,{"$nulls":4},"ワ",{"$nulls":3},9,100,9,9,9,null,9,9,9,9,9,9,9,9,9,null,9]
[]
[null,null,"tanni","tr",{"$nulls":11},"臨時　原票区分４"]
[null,null,"KVA",3,{"$nulls":10},"RPA\nCD","カード№","原票区分","訂　正",null,"撤去予定",{"$nulls":3},"営業受付No",{"$nulls":4},"撤去設計No",{"$nulls":12},"引込アーム",{"$nulls":3},"活線雑作","HS防護",null,"その他割","違反件数","RPA\nCD"]
[null,null,"A",5,{"$nulls":37},"本柱材","種別","長さ","タイ"]
[{"$nulls":3},7,{"$nulls":15},"月",null,"日"]
[{"$nulls":3},10]
[{"$nulls":3},20,{"$nulls":11},14,15,16,17,18,19,20,21,22,23,24,25,26,27,28,29,30,31,32,33,34,35,36,37,38,39,40,41,42,43,44,45,46,47,48]
[{"$nulls":3},30,{"$nulls":10},0,{"$nulls":4},0,0,0,0,0,0,0,0,0,0,0,0,{"$nulls":15},"近接1",{"$nulls":3},0]
[{"$nulls":3},50,{"$nulls":10},1,null,null,"追",null,1,1,1,1,1,1,1,1,1,1,1,1,{"$nulls":10},"W","引込腕木",0.9,"有",1,"近接2",null,"遠隔",1,1]
[{"$nulls":3},75,{"$nulls":10},2,2,null,"置",null,null,2,2,2,2,2,2,2,2,2,2,2,{"$nulls":10},"O","引込軽ア",1.2,"無",2,"近接3",null,"離島",2,2]
[{"$nulls":3},100,{"$nulls":10},3,3,null,"削",null,null,3,3,3,3,3,3,3,3,3,3,3,{"$nulls":10},"その他","導線腕木",1.5,null,3,"近接4",null,"交通",3,3]
[{"$nulls":14},4,4,4,{"$nulls":3},4,4,4,4,4,4,4,4,4,4,4,{"$nulls":11},"導線軽ア",1.8,null,4,"近接5",null,"遠隔交通",4,4]
[{"$nulls":14},5,5,{"$nulls":4},5,5,5,5,5,5,5,5,5,5,5,{"$nulls":14},5,"変台1",null,"離島交通",5,5]
[{"$nulls":14},6,6,{"$nulls":4},6,null,6,6,6,6,6,6,6,6,6,{"$nulls":14},6,"変台2",null,null,6,6]
[{"$nulls":14},7,7,{"$nulls":4},7,null,7,7,7,7,7,7,7,7,7,{"$nulls":14},7,"変台3",null,null,7,7]
[{"$nulls":14},8,8,{"$nulls":4},8,null,8,8,8,8,8,8,8,8,8,{"$nulls":14},8,"変台4",null,null,8,8]
[{"$nulls":14},9,9,{"$nulls":4},9,null,9,9,9,9,9,9,9,9,9,{"$nulls":14},9,"変台5",null,null,9,9]

{"sheet":"マスタデータ2","index":13,"n_rows":75,"n_cols":6,"rows_kept":75,"hidden":true}
[]
[null,"VTB9438_引込線OCR用工事事業所_本番配電（VZDB）_HAIDENYY　参照"]
[null,"select * from VTB9438 order by JIGYO_CD"]
[null,"事業所CD","事業所CD上3桁","事業所CD下4桁","事業所略号1","事業所略号2"]
[null,"2101","210","0171","旭川支店　　　　","配電－１　　　　"]
[null,"2102","210","0172","旭川支店　　　　","配電－２　　　　"]
[null,"2103","210","0173","旭川支店　　　　","配電－３　　　　"]
[null,"2104","210","0174","旭川支店　　　　","配電－４　　　　"]
[null,"2111","211","0171","名寄ＮＷＣ　　　","配電－１　　　　"]
[null,"2112","211","0172","名寄ＮＷＣ　　　","配電－２　　　　"]
[null,"2120","212","0000","羽幌ＮＷＣ　　　","　　　　　　　　"]
[null,"2130","213","0170","稚内ＮＷＣ　　　","配電課　　　　　"]
[null,"2140","214","0170","留萌ＮＷＣ　　　","配電課　　　　　"]
[null,"2150","215","0170","浜頓別ＮＷＣ　　","配電課　　　　　"]
[null,"2160","216","0170","深川ＮＷＣ　　　","配電課　　　　　"]
[null,"2170","217","0000","天塩ＮＷＣ　　　","　　　　　　　　"]
[null,"2180","218","0170","富良野ＮＷＣ　　","配電課　　　　　"]
[null,"2501","250","0171","北見支店　　　　","配電－１　　　　"]
[null,"2502","250","0172","北見支店　　　　","配電－２　　　　"]
[null,"2503","250","0173","北見支店　　　　","配電－３　　　　"]
[null,"2520","252","0170","紋別ＮＷＣ　　　","配電課　　　　　"]
[null,"2540","254","0170","遠軽ＮＷＣ　　　","配電課　　　　　"]
[null,"2560","256","0170","網走ＮＷＣ　　　","配電課　　　　　"]
[null,"2580","258","0000","斜里ＮＷＣ　　　","　　　　　　　　"]
[null,"3101","310","0161","札幌支店　　　　","技術－１　　　　"]
[null,"3102","310","0162","札幌支店　　　　","技術－２　　　　"]
[null,"3111","311","0171","札幌北ＮＷＣ　　","配電－１　　　　"]
[null,"3112","311","0172","札幌北ＮＷＣ　　","配電－２　　　　"]
[null,"3131","313","0171","札幌西ＮＷＣ　　","配電－１　　　　"]
[null,"3132","313","0172","札幌西ＮＷＣ　　","配電－２　　　　"]
[null,"3151","315","0171","札幌東ＮＷＣ　　","配電－１　　　　"]
[null,"3152","315","0172","札幌東ＮＷＣ　　","配電－２　　　　"]
[null,"3171","317","0171","札幌南ＮＷＣ　　","配電－１　　　　"]
[null,"3172","317","0172","札幌南ＮＷＣ　　","配電－２　　　　"]
[null,"3190","319","0170","千歳ＮＷＣ　　　","配電課　　　　　"]
[null,"3301","330","0171","岩見沢支店　　　","配電－１　　　　"]
[null,"3302","330","0172","岩見沢支店　　　","配電－２　　　　"]
[null,"3303","330","0173","岩見沢支店　　　","配電－３　　　　"]
[null,"3320","332","0171","滝川ＮＷＣ　　　","配電－１　　　　"]
[null,"3340","334","0170","栗山ＮＷＣ　　　","配電課　　　　　"]
[null,"3501","350","0171","小樽支店　　　　","配電－１　　　　"]
[null,"3502","350","0172","小樽支店　　　　","配電－２　　　　"]
[null,"3503","350","0173","小樽支店　　　　","配電－３　　　　"]
[null,"3520","352","0170","余市ＮＷＣ　　　","配電課　　　　　"]
[null,"3540","354","0170","岩内ＮＷＣ　　　","配電課　　　　　"]
[null,"3560","356","0170","倶知安ＮＷＣ　　","配電課　　　　　"]
[null,"4101","410","0171","釧路支店　　　　","配電－１　　　　"]
[null,"4102","410","0172","釧路支店　　　　","配電－２　　　　"]
[null,"4103","410","0173","釧路支店　　　　","配電－３　　　　"]
[null,"4120","412","0170","中標津ＮＷＣ　　","配電課　　　　　"]
[null,"4140","414","0170","弟子屈ＮＷＣ　　","配電課　　　　　"]
[null,"4160","416","0170","根室ＮＷＣ　　　","配電課　　　　　"]
[null,"4301","430","0171","帯広支店　　　　","配電－１　　　　"]
[null,"4302","430","0172","帯広支店　　　　","配電－２　　　　"]
[null,"4303","430","0173","帯広支店　　　　","配電－３　　　　"]
[null,"4320","432","0000","新得ＮＷＣ　　　","　　　　　　　　"]
[null,"4340","434","0000","池田ＮＷＣ　　　","　　　　　　　　"]
[null,"4360","436","0000","大樹ＮＷＣ　　　","　　　　　　　　"]
[null,"4380","438","0000","足寄ＮＷＣ　　　","　　　　　　　　"]
[null,"5101","510","0171","室蘭支店　　　　","配電－１　　　　"]
[null,"5102","510","0172","室蘭支店　　　　","配電－２　　　　"]
[null,"5103","510","0173","室蘭支店　　　　","配電－３　　　　"]
[null,"5301","530","0171","苫小牧支店　　　","配電－１　　　　"]
[null,"5302","530","0172","苫小牧支店　　　","配電－２　　　　"]
[null,"5303","530","0173","苫小牧支店　　　","配電－３　　　　"]
[null,"5320","532","0170","富川ＮＷＣ　　　","配電課　　　　　"]
[null,"5340","534","0170","浦河ＮＷＣ　　　","配電課　　　　　"]
[null,"5350","535","0170","静内ＮＷＣ　　　","配電課　　　　　"]
[null,"6101","610","0171","函館支店　　　　","配電－１　　　　"]
[null,"6102","610","0172","函館支店　　　　","配電－２　　　　"]
[null,"6103","610","0173","函館支店　　　　","配電－３　　　　"]
[null,"6104","610","0174","函館支店　　　　","配電－４　　　　"]
[null,"6130","613","0170","八雲ＮＷＣ　　　","配電課　　　　　"]
[null,"6160","616","0170","江差ＮＷＣ　　　","配電課　　　　　"]
[null,"6180","618","0170","福島ＮＷＣ　　　","配電課　　　　　"]