{"text_format":"3","workbook":"xlsx","n_sheets":14,"sheets":["入力シート","新設","撤去","部修","旧裏面資料","動作ログ","改定履歴","コード変換","関連項目チェック一覧","単項目チェック一覧","単結図","平面図","マスタデータ1","マスタデータ2"],"not_rendered":{"macros":1,"external_links":1,"defined_names":123,"comments":3},"read":"whole","date_system":"1900"}

{"sheet":"入力シート","index":0,"n_rows":44,"n_cols":23,"rows_kept":44,"merged":[[0,0,1,21],[3,1,3,16],[4,1,4,16],[5,1,5,16],[7,6,7,8],[12,1,12,16],[14,1,14,16],[18,1,18,6],[18,8,18,9],[18,10,18,11],[18,12,18,13],[18,14,18,15],[18,16,18,17],[18,18,18,19],[20,1,20,2],[20,3,20,4],[20,5,20,6],[20,7,20,8],[20,9,20,10],[20,11,20,12],[20,15,20,16],[21,15,21,16],[23,1,23,2],[23,3,23,4],[23,5,23,6],[23,8,23,9],[23,10,23,11],[23,12,23,13],[25,1,25,3],[26,1,26,3],[26,8,26,9],[26,10,26,13],[26,14,26,15],[26,17,27,18],[26,20,26,21],[27,1,27,3],[27,10,27,13],[27,14,27,15],[27,20,27,21],[29,0,36,0],[29,1,32,1],[29,2,32,2],[29,3,32,3],[29,4,29,12],[29,13,32,13],[29,14,32,16],[30,4,32,4],[30,5,30,6],[30,7,32,7],[30,8,32,8],[30,9,32,9],[30,10,32,10],[30,11,32,12],[31,6,32,6],[38,0,43,0],[38,1,41,1],[38,2,41,2],[38,3,39,6],[38,7,41,11],[38,12,41,14],[38,15,38,18],[38,19,41,19],[38,20,41,20],[38,21,41,21],[38,22,41,22],[39,15,41,15],[39,16,41,16],[39,17,41,17],[39,18,41,18],[40,3,41,4],[40,5,41,6]]}
["臨時引込線工事設計書  入力シート  Ver2.04"]
[]
[]
["需要場所住所",{"$nulls":16},"必須","【手入力】"]
["目標",{"$nulls":16},"入力不要"]
["契約者名",{"$nulls":16},"必須","【手入力】"]
[]
["事業所情報","支店",null,"営業支店","営業所","グループ","営業所"]
{"$rows_left_out":37}
{"sheet":"新設","index":1,"n_rows":55,"n_cols":60,"rows_kept":55,"merged":[[0,11,1,38],[0,48,0,51],[0,52,0,55],[0,56,0,59],[1,48,3,51],[1,52,3,55],[1,56,3,59],[2,0,2,3],[2,4,3,20],[2,21,2,22],[2,23,3,45],[4,0,5,3],[4,4,4,5],[4,6,5,9],[4,13,4,14],[4,15,5,18],[4,21,5,21],[4,22,4,24],[4,25,5,34],[4,35,4,37],[4,38,5,45],[5,22,5,24],[7,9,7,12],[7,13,10,18],[7,19,10,21],[7,22,10,22],[7,23,10,23],[7,24,7,32],[7,33,10,33],[7,34,10,34],[7,35,10,35],[7,36,7,45],[7,46,10,46],[7,47,10,49],[7,50,8,55],[7,56,10,56],[7,57,11,59],[8,9,10,9],[8,10,10,10],[8,11,10,11],[8,12,10,12],[8,24,10,26],[8,27,8,32],[8,36,10,36],[8,37,8,39],[8,40,10,40],[8,41,10,41],[8,42,10,42],[8,43,10,43],[8,44,10,45],[9,27,10,28],[9,29,10,30],[9,31,10,32],[9,37,9,38],[9,39,10,39],[9,50,10,51],[9,52,10,53],[9,54,10,55],[12,9,13,9],[12,10,13,10],[12,11,13,11],[12,12,13,12],[12,13,13,13],[12,14,13,14],[12,15,13,15],[12,16,13,16],[12,17,13,17],[12,18,13,18],[12,19,13,19],[12,20,13,20],[12,21,13,21],[12,22,13,22],[12,23,13,23],[12,24,13,24],[12,25,13,25],[12,26,13,26],[12,27,13,27],[12,28,13,28],[12,29,13,29],[12,30,13,30],[12,31,13,31],[12,32,13,32],[12,33,13,33],[12,34,13,34],[12,35,13,35],[12,36,13,36],[12,37,13,37],[12,38,13,38],[12,39,13,39],[12,40,13,40],[12,41,13,41],[12,42,13,42],[12,43,13,43],[12,44,13,44],[12,45,13,45],[12,46,13,46],[12,47,13,47],[12,48,13,48],[12,49,13,49],[12,50,13,50],[12,51,13,51],[12,52,13,52],[12,53,13,53],[12,54,13,54],[12,55,13,55],[12,56,13,56],[14,0,15,4],[14,22,15,22],[14,23,15,23],[14,24,15,32],[14,33,15,33],[14,34,15,34],[14,35,15,35],[14,36,15,36],[14,37,15,37],[14,38,15,38],[14,39,15,39],[14,40,15,40],[14,41,15,41],[14,42,15,42],[14,43,15,43],[14,44,15,44],[14,45,15,45],[14,46,15,46],[14,47,15,49],[14,50,15,55],[14,56,15,56],[16,22,17,22],[16,23,17,23],[16,24,17,32],[16,33,17,33],[16,34,17,34],[16,35,17,35],[16,36,17,36],[16,37,17,37],[16,38,17,38],[16,39,17,39],[16,40,17,40],[16,41,17,41],[16,42,17,42],[16,43,17,43],[16,44,17,44],[16,45,17,45],[16,46,17,46],[16,47,17,49],[16,50,17,55],[16,56,17,56],[18,47,18,56],[20,22,23,22],[20,23,23,23],[20,24,23,24],[20,25,23,25],[20,26,21,29],[20,30,23,34],[20,35,23,37],[20,38,23,47],[20,48,20,51],[20,52,23,52],[20,53,23,53],[20,54,23,54],[20,55,23,55],[20,56,23,56],[20,57,24,59],[21,48,23,48],[21,49,23,49],[21,50,23,50],[21,51,23,51],[22,26,23,27],[22,28,23,29],[25,22,26,22],[25,23,26,23],[25,24,26,24],[25,25,26,25],[25,26,26,26],[25,27,26,27],[25,28,26,28],[25,29,26,29],[25,30,26,30],[25,31,26,31],[25,32,26,32],[25,33,26,33],[25,34,26,34],[25,35,26,35],[25,36,26,36],[25,37,26,37],[25,38,26,38],[25,39,26,39],[25,40,26,40],[25,41,26,41],[25,42,26,42],[25,43,26,43],[25,44,26,44],[25,45,26,45],[25,46,26,46],[25,47,26,47],[25,48,26,48],[25,49,26,49],[25,50,26,50],[25,51,26,51],[25,52,26,52],[25,53,26,53],[25,54,26,54],[25,55,26,55],[25,56,26,56],[27,26,27,34],[27,35,27,37],[27,44,29,49],[27,50,29,59],[30,44,32,49],[31,51,32,53],[31,56,32,58],[33,44,35,47],[33,48,35,48],[33,49,35,52],[33,53,35,53],[33,54,35,54],[33,55,35,58],[33,59,35,59],[36,40,36,45],[36,46,37,47],[36,48,37,53],[36,54,37,55],[36,56,37,58],[36,59,37,59],[37,40,37,45],[38,41,38,58],[39,41,39,58],[40,41,40,58],[41,29,41,39],[41,41,41,58],[42,29,42,31],[42,32,43,39],[42,41,42,58],[43,29,43,31],[43,41,43,58],[44,29,44,31],[44,32,45,39],[44,41,44,58],[45,29,45,31],[45,41,45,58]]}
["ver2.04(2021.9)",{"$nulls":10},"　臨時引込線工事設計書（新設）",{"$nulls":36},"上長",{"$nulls":3},"検収担当",{"$nulls":3},"設計照査"]
[{"$f":"IF(入力シート!N11<>\"\",\"NW受付番号：\" & 入力シート!N11,\"NW受付番号：\")","v":"NW受付番号："}]
["お客さま名",{"$nulls":3},{"$f":"IF(入力シート!B6<>\"\",入力シート!B6,\"\")","v":""},{"$nulls":16},"住所",null,{"$f":"IF(入力シート!B4<>\"\",入力シート!B4,\"\")","v":""}]
[]
["申し込み\n内容",{"$nulls":3},"電灯",null,{"$f":"IF(入力シート!D24<>\"\",入力シート!D24,\"\")","v":""},{"$nulls":6},"電力",null,{"$f":"IF(入力シート!K24<>\"\",入力シート!K24,\"\")","v":""},{"$nulls":5},"設計","工事",null,null,{"$f":"IF(入力シート!B13<>\"\",入力シート!B13,\"\")","v":""},{"$nulls":9},"担当者",null,null,{"$f":"IF(入力シート!B15<>\"\",入力シート!B15,\"\")","v":""}]
[{"$nulls":12},{"$f":"IF(入力シート!F24<>\"\",入力シート!F24,\"\")","v":"A"},{"$nulls":7},"kW",null,"会社名"]
[]
[{"$nulls":9},"事業所",{"$nulls":3},"工事会社",{"$nulls":5},"設計書No",null,null,"カード№","原票区分",{"$nulls":9},"工事区分","訂　正","付　外","引　込　線",{"$nulls":9},"設計工量","供給\nKW\n(100W)",null,null,"引込柱No",{"$nulls":6},"インプット\n\nチェック"]
{"$rows_left_out":48}
{"sheet":"撤去","index":2,"n_rows":55,"n_cols":60,"rows_kept":55,"merged":[[0,11,1,38],[0,48,0,51],[0,52,0,55],[0,56,0,59],[1,48,3,51],[1,52,3,55],[1,56,3,59],[2,0,2,3],[2,4,3,20],[2,21,2,22],[2,23,3,45],[4,0,5,3],[4,4,4,5],[4,6,5,9],[4,13,4,14],[4,15,5,18],[4,21,5,21],[4,22,4,24],[4,25,5,34],[4,35,4,37],[4,38,5,45],[5,22,5,24],[7,9,7,12],[7,13,10,18],[7,19,10,21],[7,22,10,22],[7,23,10,23],[7,24,7,32],[7,33,10,33],[7,34,10,34],[7,35,10,35],[7,36,7,45],[7,46,10,46],[7,47,10,49],[7,50,8,55],[7,56,10,56],[7,57,11,59],[8,9,10,9],[8,10,10,10],[8,11,10,11],[8,12,10,12],[8,24,10,26],[8,27,8,32],[8,36,10,36],[8,37,8,39],[8,40,10,40],[8,41,10,41],[8,42,10,42],[8,43,10,43],[8,44,10,45],[9,27,10,28],[9,29,10,30],[9,31,10,32],[9,37,9,38],[9,39,10,39],[9,50,10,51],[9,52,10,53],[9,54,10,55],[12,9,13,9],[12,10,13,10],[12,11,13,11],[12,12,13,12],[12,13,13,13],[12,14,13,14],[12,15,13,15],[12,16,13,16],[12,17,13,17],[12,18,13,18],[12,19,13,19],[12,20,13,20],[12,21,13,21],[12,22,13,22],[12,23,13,23],[12,24,13,24],[12,25,13,25],[12,26,13,26],[12,27,13,27],[12,28,13,28],[12,29,13,29],[12,30,13,30],[12,31,13,31],[12,32,13,32],[12,33,13,33],[12,34,13,34],[12,35,13,35],[12,36,13,36],[12,37,13,37],[12,38,13,38],[12,39,13,39],[12,40,13,40],[12,41,13,41],[12,42,13,42],[12,43,13,43],[12,44,13,44],[12,45,13,45],[12,46,13,46],[12,47,13,47],[12,48,13,48],[12,49,13,49],[12,50,13,50],[12,51,13,51],[12,52,13,52],[12,53,13,53],[12,54,13,54],[12,55,13,55],[12,56,13,56],[14,0,15,4],[14,22,15,22],[14,23,15,23],[14,24,15,32],[14,33,15,33],[14,34,15,34],[14,35,15,35],[14,36,15,36],[14,37,15,37],[14,38,15,38],[14,39,15,39],[14,40,15,40],[14,41,15,41],[14,42,15,42],[14,43,15,43],[14,44,15,44],[14,45,15,45],[14,46,15,46],[14,47,15,49],[14,50,15,55],[14,56,15,56],[16,22,17,22],[16,23,17,23],[16,24,17,32],[16,33,17,33],[16,34,17,34],[16,35,17,35],[16,36,17,36],[16,37,17,37],[16,38,17,38],[16,39,17,39],[16,40,17,40],[16,41,17,41],[16,42,17,42],[16,43,17,43],[16,44,17,44],[16,45,17,45],[16,46,17,46],[16,47,17,49],[16,50,17,55],[16,56,17,56],[18,47,18,56],[20,22,23,22],[20,23,23,23],[20,24,23,24],[20,25,23,25],[20,26,21,29],[20,30,23,34],[20,35,23,37],[20,38,23,47],[20,48,20,51],[20,52,23,52],[20,53,23,53],[20,54,23,54],[20,55,23,55],[20,56,23,56],[20,57,24,59],[21,48,23,48],[21,49,23,49],[21,50,23,50],[21,51,23,51],[22,26,23,27],[22,28,23,29],[25,22,26,22],[25,23,26,23],[25,24,26,24],[25,25,26,25],[25,26,26,26],[25,27,26,27],[25,28,26,28],[25,29,26,29],[25,30,26,30],[25,31,26,31],[25,32,26,32],[25,33,26,33],[25,34,26,34],[25,35,26,35],[25,36,26,36],[25,37,26,37],[25,38,26,38],[25,39,26,39],[25,40,26,40],[25,41,26,41],[25,42,26,42],[25,43,26,43],[25,44,26,44],[25,45,26,45],[25,46,26,46],[25,47,26,47],[25,48,26,48],[25,49,26,49],[25,50,26,50],[25,51,26,51],[25,52,26,52],[25,53,26,53],[25,54,26,54],[25,55,26,55],[25,56,26,56],[27,26,27,34],[27,35,27,37],[27,44,29,49],[27,50,29,59],[30,44,32,49],[31,51,32,53],[31,56,32,58],[33,44,35,47],[33,48,35,48],[33,49,35,52],[33,53,35,53],[33,54,35,54],[33,55,35,58],[33,59,35,59],[36,40,36,45],[36,46,37,47],[36,48,37,53],[36,54,37,55],[36,56,37,58],[36,59,37,59],[37,40,37,45],[38,41,38,58],[39,41,39,58],[40,41,40,58],[41,29,41,39],[41,41,41,58],[42,29,42,31],[42,32,43,39],[42,41,42,58],[43,29,43,31],[43,41,43,58],[44,29,44,31],[44,32,45,39],[44,41,44,58],[45,29,45,31],[45,41,45,58]]}
[{"$f":"新設!A1","v":"ver2.04(2021.9)"},{"$nulls":10},"　臨時引込線工事設計書（撤去）",{"$nulls":36},"上長",{"$nulls":3},"検収担当",{"$nulls":3},"設計照査"]
[{"$f":"IF(入力シート!N11<>\"\",\"NW受付番号：\" & 入力シート!N11,\"NW受付番号：\")","v":"NW受付番号："}]
["お客さま名",{"$nulls":3},{"$f":"IF(入力シート!B6<>\"\",入力シート!B6,\"\")","v":""},{"$nulls":16},"住所",null,{"$f":"IF(入力シート!B4<>\"\",入力シート!B4,\"\")","v":""}]
[]
["申し込み\n内容",{"$nulls":3},"電灯",null,"-",{"$nulls":6},"電力",null,"-",{"$nulls":5},"設計","工事",null,null,{"$f":"IF(入力シート!B13<>\"\",入力シート!B13,\"\")","v":""},{"$nulls":9},"担当者",null,null,{"$f":"IF(入力シート!B15<>\"\",入力シート!B15,\"\")","v":""}]
[{"$nulls":12},{"$f":"IF(入力シート!F24<>\"\",入力シート!F24,\"\")","v":"A"},{"$nulls":7},"kW",null,"会社名"]
[]
[{"$nulls":9},"事業所",{"$nulls":3},"工事会社",{"$nulls":5},"設計書No",null,null,"カード№","原票区分",{"$nulls":9},"工事区分","訂　正","付　外","引　込　線",{"$nulls":9},"設計工量","供給\nKW\n(100W)",null,null,"引込柱No",{"$nulls":6},"インプット\n\nチェック"]
{"$rows_left_out":48}
{"sheet":"部修","index":3,"n_rows":55,"n_cols":60,"rows_kept":55,"merged":[[0,11,1,38],[0,48,0,51],[0,52,0,55],[0,56,0,59],[1,48,3,51],[1,52,3,55],[1,56,3,59],[2,0,2,3],[2,4,3,20],[2,21,2,22],[2,23,3,45],[4,0,5,3],[4,4,4,5],[4,6,5,9],[4,13,4,14],[4,15,5,18],[4,21,5,21],[4,22,4,24],[4,25,5,34],[4,35,4,37],[4,38,5,45],[5,22,5,24],[7,9,7,12],[7,13,10,18],[7,19,10,21],[7,22,10,22],[7,23,10,23],[7,24,7,32],[7,33,10,33],[7,34,10,34],[7,35,10,35],[7,36,7,45],[7,46,10,46],[7,47,10,49],[7,50,8,55],[7,56,10,56],[7,57,11,59],[8,9,10,9],[8,10,10,10],[8,11,10,11],[8,12,10,12],[8,24,10,26],[8,27,8,32],[8,36,10,36],[8,37,8,39],[8,40,10,40],[8,41,10,41],[8,42,10,42],[8,43,10,43],[8,44,10,45],[9,27,10,28],[9,29,10,30],[9,31,10,32],[9,37,9,38],[9,39,10,39],[9,50,10,51],[9,52,10,53],[9,54,10,55],[12,9,13,9],[12,10,13,10],[12,11,13,11],[12,12,13,12],[12,13,13,13],[12,14,13,14],[12,15,13,15],[12,16,13,16],[12,17,13,17],[12,18,13,18],[12,19,13,19],[12,20,13,20],[12,21,13,21],[12,22,13,22],[12,23,13,23],[12,24,13,24],[12,25,13,25],[12,26,13,26],[12,27,13,27],[12,28,13,28],[12,29,13,29],[12,30,13,30],[12,31,13,31],[12,32,13,32],[12,33,13,33],[12,34,13,34],[12,35,13,35],[12,36,13,36],[12,37,13,37],[12,38,13,38],[12,39,13,39],[12,40,13,40],[12,41,13,41],[12,42,13,42],[12,43,13,43],[12,44,13,44],[12,45,13,45],[12,46,13,46],[12,47,13,47],[12,48,13,48],[12,49,13,49],[12,50,13,50],[12,51,13,51],[12,52,13,52],[12,53,13,53],[12,54,13,54],[12,55,13,55],[12,56,13,56],[14,0,15,4],[14,22,15,22],[14,23,15,23],[14,24,15,32],[14,33,15,33],[14,34,15,34],[14,35,15,35],[14,36,15,36],[14,37,15,37],[14,38,15,38],[14,39,15,39],[14,40,15,40],[14,41,15,41],[14,42,15,42],[14,43,15,43],[14,44,15,44],[14,45,15,45],[14,46,15,46],[14,47,15,49],[14,50,15,55],[14,56,15,56],[16,22,17,22],[16,23,17,23],[16,24,17,32],[16,33,17,33],[16,34,17,34],[16,35,17,35],[16,36,17,36],[16,37,17,37],[16,38,17,38],[16,39,17,39],[16,40,17,40],[16,41,17,41],[16,42,17,42],[16,43,17,43],[16,44,17,44],[16,45,17,45],[16,46,17,46],[16,47,17,49],[16,50,17,55],[16,56,17,56],[18,47,18,56],[20,22,23,22],[20,23,23,23],[20,24,23,24],[20,25,23,25],[20,26,21,29],[20,30,23,34],[20,35,23,37],[20,38,23,47],[20,48,20,51],[20,52,23,52],[20,53,23,53],[20,54,23,54],[20,55,23,55],[20,56,23,56],[20,57,24,59],[21,48,23,48],[21,49,23,49],[21,50,23,50],[21,51,23,51],[22,26,23,27],[22,28,23,29],[25,22,26,22],[25,23,26,23],[25,24,26,24],[25,25,26,25],[25,26,26,26],[25,27,26,27],[25,28,26,28],[25,29,26,29],[25,30,26,30],[25,31,26,31],[25,32,26,32],[25,33,26,33],[25,34,26,34],[25,35,26,35],[25,36,26,36],[25,37,26,37],[25,38,26,38],[25,39,26,39],[25,40,26,40],[25,41,26,41],[25,42,26,42],[25,43,26,43],[25,44,26,44],[25,45,26,45],[25,46,26,46],[25,47,26,47],[25,48,26,48],[25,49,26,49],[25,50,26,50],[25,51,26,51],[25,52,26,52],[25,53,26,53],[25,54,26,54],[25,55,26,55],[25,56,26,56],[27,26,27,34],[27,35,27,37],[27,44,29,49],[27,50,29,59],[30,44,32,49],[31,51,32,53],[31,56,32,58],[33,44,35,47],[33,48,35,48],[33,49,35,52],[33,53,35,53],[33,54,35,54],[33,55,35,58],[33,59,35,59],[36,40,36,45],[36,46,37,47],[36,48,37,53],[36,54,37,55],[36,56,37,58],[36,59,37,59],[37,40,37,45],[38,41,38,58],[39,41,39,58],[40,41,40,58],[41,29,41,39],[41,41,41,58],[42,29,42,31],[42,32,43,39],[42,41,42,58],[43,29,43,31],[43,41,43,58],[44,29,44,31],[44,32,45,39],[44,41,44,58],[45,29,45,31],[45,41,45,58]]}
[{"$f":"新設!A1","v":"ver2.04(2021.9)"},{"$nulls":10},"　臨時引込線工事設計書（部修）",{"$nulls":36},"上長",{"$nulls":3},"検収担当",{"$nulls":3},"設計照査"]
[{"$f":"IF(入力シート!N11<>\"\",\"NW受付番号：\" & 入力シート!N11,\"NW受付番号：\")","v":"NW受付番号："}]
["お客さま名",{"$nulls":3},{"$f":"IF(入力シート!B6<>\"\",入力シート!B6,\"\")","v":""},{"$nulls":16},"住所",null,{"$f":"IF(入力シート!B4<>\"\",入力シート!B4,\"\")","v":""}]
[]
["申し込み\n内容",{"$nulls":3},"電灯",null,{"$f":"IF(入力シート!D24<>\"\",入力シート!D24,\"\")","v":""},{"$nulls":6},"電力",null,{"$f":"IF(入力シート!K24<>\"\",入力シート!K24,\"\")","v":""},{"$nulls":5},"設計","工事",null,null,{"$f":"IF(入力シート!B13<>\"\",入力シート!B13,\"\")","v":""},{"$nulls":9},"担当者",null,null,{"$f":"IF(入力シート!B15<>\"\",入力シート!B15,\"\")","v":""}]
[{"$nulls":12},{"$f":"IF(入力シート!F24<>\"\",入力シート!F24,\"\")","v":"A"},{"$nulls":7},"kW",null,"会社名"]
[]
[{"$nulls":9},"事業所",{"$nulls":3},"工事会社",{"$nulls":5},"設計書No",null,null,"カード№","原票区分",{"$nulls":9},"工事区分","訂　正","付　外","引　込　線",{"$nulls":9},"設計工量","供給\nKW\n(100W)",null,null,"引込柱No",{"$nulls":6},"インプット\n\nチェック"]
{"$rows_left_out":48}
{"sheet":"旧裏面資料","index":4,"n_rows":25,"n_cols":33,"rows_kept":25,"merged":[[2,1,3,2],[2,3,3,4],[2,7,3,14],[2,15,3,16],[2,18,3,19],[2,20,3,21],[2,23,3,24],[2,27,3,28],[2,29,3,30],[4,1,4,2],[4,3,4,4],[4,7,4,14],[4,15,4,16],[4,18,4,19],[4,20,4,21],[4,23,4,24],[4,27,4,28],[4,29,4,30],[5,1,5,2],[5,3,5,4],[5,7,5,14],[5,15,5,16],[5,18,5,19],[5,20,5,21],[5,23,5,24],[5,27,5,28],[5,29,5,30],[6,1,6,2],[6,3,6,4],[6,7,6,14],[6,15,6,16],[6,18,6,19],[6,20,6,21],[6,23,6,24],[6,27,6,28],[6,29,6,30],[7,1,7,2],[7,3,7,4],[7,7,7,14],[7,15,7,16],[7,18,7,19],[7,20,7,21],[7,23,7,24],[7,27,7,28],[7,29,7,30],[8,7,8,14],[8,15,8,16],[8,23,8,24],[9,7,9,14],[9,15,9,16],[9,23,9,24],[10,7,10,14],[10,15,10,16],[10,23,10,24],[11,7,11,14],[11,15,11,16],[11,23,11,24],[12,23,12,24],[13,23,13,24],[16,1,16,15],[16,17,16,29],[17,1,18,3],[17,4,17,15],[17,17,18,19],[17,20,17,29],[18,4,18,7],[18,8,18,11],[18,12,18,15],[18,20,18,24],[18,25,18,29],[19,1,19,3],[19,4,19,7],[19,8,19,11],[19,12,19,15],[19,17,19,19],[19,20,19,24],[19,25,19,29],[20,1,20,3],[20,4,20,7],[20,8,20,11],[20,12,20,15],[20,17,20,19],[20,20,20,24],[20,25,20,29],[21,1,21,3],[21,4,21,7],[21,8,21,11],[21,12,21,15],[21,17,21,19],[21,20,21,24],[21,25,21,29],[22,1,22,3],[22,4,22,7],[22,8,22,11],[22,12,22,15],[22,17,22,19],[22,20,22,24],[22,25,22,29],[23,1,23,3],[23,4,23,7],[23,8,23,11],[23,12,23,15],[23,17,23,19],[23,20,23,24],[23,25,23,29],[24,1,24,3],[24,4,24,7],[24,8,24,11],[24,12,24,15]]}
[]
[null,"カラム26",{"$nulls":5},"カラム29",{"$nulls":10},"カラム31",{"$nulls":4},"カラム34",{"$nulls":3},"カラム38"]
[null,"訂正",null,"記入\n記号",{"$nulls":3},"パターン1",{"$nulls":7},"記入\n記号",null,null,"線種",null,"記入\n記号",null,null,"太さ\n記入",{"$nulls":3},"設計",null,"記入\n記号",null,null,"（注）設計工量の記入"]
[{"$nulls":32},"新設と撤去の設計は同時に行うことから、設計工量は、両方合わせて1口とし、"]
[null,"追加",null,"追",{"$nulls":3},"部分修繕",{"$nulls":7},"部",null,null,"D V",null,"D",null,null,2.6,{"$nulls":3},"要",null,"要",null,null,"新設設計書の方を「要」とする。"]
[null,"置換",null,"置",{"$nulls":3},"単独直接",{"$nulls":7},"単",null,null,"I V",null,"I",null,null,3.2,{"$nulls":3},"不要",null,"不"]
[null,"削除",null,"削",{"$nulls":3},"単独共架小",{"$nulls":7},"小",null,null,"V V",null,"V",{"$nulls":6},"のみ",null,"の"]
[null,"取消",null,"取",{"$nulls":3},"単独共架大",{"$nulls":7},"大",null,null,"S T",null,"S",null,null,8,{"$nulls":3},"メ要",null,"メ"]
{"$rows_left_out":18}
{"sheet":"動作ログ","index":5,"n_rows":3,"n_cols":7,"rows_kept":3}
["処理年月日","処理時刻","処理結果","備考１","備考２"]
[]
[{"$nulls":6},"\n"]

{"sheet":"改定履歴","index":6,"n_rows":17,"n_cols":3,"rows_kept":17}
["バージョン","更新日","更新内容"]
["1.00",null,"託送Web導入に伴い新規制定"]
["2.00","2020-04-01","様式見直しに伴う改定　引込線工事実施承認書⇒引込線工事設計書"]
[null,null,"引込柱番号・工事会社コードなど数値入力をプルダウンから直接入力へ変更"]
[null,null,"施工情報（道路横断・地上高・径間長）入力欄を新設"]
["2.01","2020-09-04","各種不具合修正"]
[null,null,"原票項目・訂正欄が「追加」表示固定となっていた不具合を修正"]
[null,null,"平面図・図形の変形に制約があったものを修正"]
{"$rows_left_out":10}
{"sheet":"コード変換","index":7,"n_rows":23,"n_cols":38,"rows_kept":23,"hidden":true,"merged":[[1,13,1,15],[1,16,1,18],[1,20,1,22],[1,23,1,25],[1,27,1,29],[1,30,1,32],[1,34,1,36],[1,37,1,39],[4,13,7,13],[4,14,4,17],[4,18,7,18],[4,19,7,19],[4,20,7,20],[4,21,4,28],[4,29,7,29],[4,30,7,30],[4,31,4,33],[4,34,4,37],[5,14,7,14],[5,15,5,17],[5,21,7,21],[5,22,5,23],[5,24,7,24],[5,25,7,25],[5,26,7,26],[5,27,7,27],[5,28,7,28],[5,31,7,31],[5,32,7,32],[5,33,7,33],[5,34,5,35],[5,36,5,37],[6,15,7,15],[6,16,7,16],[6,17,7,17],[6,23,7,23],[6,34,7,34],[6,35,7,35],[6,36,7,36],[6,37,7,37],[18,13,21,13],[18,14,21,14],[18,15,19,16],[18,17,21,17],[18,18,21,18],[18,19,18,22],[18,23,21,23],[18,24,21,24],[18,25,21,25],[18,26,21,26],[18,27,19,29],[19,19,21,19],[19,20,21,20],[19,21,21,21],[19,22,21,22],[20,15,21,15],[20,16,21,16],[20,27,21,27],[20,28,21,28],[20,29,21,29]]}
[]
[null,"事業所",{"$f":"IF(入力シート!B9<>\"\",VLOOKUP(入力シート!B9,マスタデータ1!C8:AY19,49,FALSE),\"\")","v":""},{"$f":"IF(入力シート!D9<>\"\",入力シート!D9,\"\")","v":""},{"$f":"IF(入力シート!E9<>\"\",入力シート!E9,\"\")","v":""},{"$f":"IF(入力シート!F9<>\"\",入力シート!F9,\"\")","v":""},{"$f":"CONCATENATE(C2,D2,E2,F2)","v":""},{"$nulls":6},"事業所",null,null,{"$f":"G2","v":""},{"$nulls":3},"工事会社",null,null,{"$f":"H4","v":""},{"$nulls":3},"設計書No",null,null,{"$f":"F5","v":""},{"$nulls":3},"NW受付番号"]
[null,"営業所",{"$f":"IF(入力シート!G9<>\"\",入力シート!G9,\"\")","v":""},{"$f":"IF(入力シート!H9<>\"\",入力シート!H9,\"\")","v":""},{"$f":"IF(入力シート!I9<>\"\",入力シート!I9,\"\")","v":0},null,{"$f":"CONCATENATE(C3,D3,E3)","v":"0"}]
[null,"工事会社",{"$f":"IF(入力シート!B11<>\"\",入力シート!B11,\"\")","v":""},{"$f":"IF(入力シート!C11<>\"\",入力シート!C11,\"\")","v":""},{"$f":"IF(入力シート!E11<>\"\",入力シート!E11,\"\")","v":""},{"$f":"IF(入力シート!F11<>\"\",入力シート!F11,\"\")","v":""},{"$f":"IF(入力シート!G11<>\"\",入力シート!G11,\"\")","v":""},{"$f":"CONCATENATE(C4,D4,E4,F4,G4)","v":""},{"$f":"CONCATENATE(C4,D4,\"-\",E4,F4,G4)","v":"-"}]
[null,"設計No",{"$f":"IF(入力シート!B17<>\"\",入力シート!B17,\"\")","v":""},{"$f":"IF(入力シート!C17<>\"\",入力シート!C17,\"\")","v":""},{"$f":"IF(入力シート!D17<>\"\",入力シート!D17,\"\")","v":""},{"$f":"CONCATENATE(C5,D5,E5)","v":""},{"$f":"IF(F5<>\"\",F5+1,\"\")","v":""},{"$f":"IF(LEN(G5)=3,G5,IF(LEN(G5)=2,CONCATENATE(\"0\",G5),IF(LEN(G5)=1,CONCATENATE(\"00\",G5),\"\")))","v":""},{"$nulls":5},"カード№","工事場所",{"$nulls":3},"工事区分","訂　正","付　外","引　込　線",{"$nulls":7},"設計工量","供給KW","引込柱No",null,null,"＜参考＞部修"]
[null,"画",{"$f":"IF(入力シート!I20<>\"\",入力シート!I20,\"\")","v":""},{"$f":"IF(入力シート!J20<>\"\",入力シート!J20,\"\")","v":""},{"$f":"CONCATENATE(C6,D6)","v":""},{"$nulls":9},"営業所","メッシュNo",{"$nulls":5},"灯　力","パターン",null,"条　数","電話防護","太　さ","口　数","総亘長",null,null,"番","の","号","取付",null,"取外"]
[null,"区",{"$f":"IF(入力シート!K20<>\"\",入力シート!K20,\"\")","v":""},{"$f":"IF(入力シート!L20<>\"\",入力シート!L20,\"\")","v":""},{"$f":"CONCATENATE(C7,D7)","v":""},{"$nulls":10},"画","区","図",{"$nulls":4},"方式","線種",{"$nulls":10},"口数","亘長","口数","亘長"]
[null,"図",{"$f":"IF(入力シート!M20<>\"\",入力シート!M20,\"\")","v":""},{"$f":"IF(入力シート!N20<>\"\",入力シート!N20,\"\")","v":""},"",{"$nulls":17},1]
{"$rows_left_out":16}
{"sheet":"関連項目チェック一覧","index":8,"n_rows":24,"n_cols":18,"rows_kept":24,"hidden":true,"merged":[[3,0,3,5],[3,6,3,11],[3,13,3,15],[3,16,3,17],[5,5,6,5],[8,5,10,5],[8,12,10,12],[12,5,13,5],[12,12,13,12],[15,5,19,5],[15,12,19,12],[21,5,23,5],[21,12,23,12]]}
[]
["組合せチェック一覧"]
[]
["関連チェック詳細",{"$nulls":5},"入力許可",{"$nulls":5},"出力メッセージ","RPA変換シート",null,null,"入力シート"]
["項目\n種別","原票区分","チェック種別","項目\n分類","チェック項目","表示メッセージ","前提条件","英字","数字(離散値)","数字(連続値)","スペース","全て","メッセージ（※未使用項目）","対応行","対応列","対応\n桁位置","対応行","対応列"]
["01","0","必須関連チェック","01","電灯申込（定額）","・申込情報の電灯、動力は合計0以上の数値を入力してください。",{"$nulls":3},"*",null,null,"申込情報エラー","-","-","-","24","4"]
["01","0","必須関連チェック","01","電力申込（従量）",{"$nulls":4},"*",null,null,"申込情報エラー","-","-","-","24","11"]
[]
{"$rows_left_out":17}
{"sheet":"単項目チェック一覧","index":9,"n_rows":79,"n_cols":18,"rows_kept":79,"hidden":true,"merged":[[3,0,3,5],[3,6,3,11],[3,13,3,15],[3,16,3,17]]}
[]
["単項目チェック一覧"]
[]
["単項目チェック詳細",{"$nulls":5},"入力許可",{"$nulls":5},"出力メッセージ","RPA変換シート",null,null,"入力シート"]
["項目\n種別","原票区分","チェック種別","項目\n分類","チェック項目","表示メッセージ","必須","英字","数字(離散値)","数字(連続値)","スペース","全て","メッセージ（※未使用項目）","対応行","対応列","対応\n桁位置","対応行","対応列"]
["31","0","単体チェック","01","・需要場所住所",null,"○",{"$nulls":4},"○","申込者情報エラー","-","-","-","4","2"]
["31","0","単体チェック","01","・目標",{"$nulls":6},"○","申込者情報エラー","-","-","-","5","2"]
["31","0","単体チェック","01","・契約者名",null,"○",{"$nulls":4},"○","申込者情報エラー","-","-","-","6","2"]
{"$rows_left_out":72}
{"sheet":"単結図","index":10,"n_rows":0,"n_cols":0,"rows_kept":0,"hidden":true}

{"sheet":"平面図","index":11,"n_rows":0,"n_cols":0,"rows_kept":0,"hidden":true}

{"sheet":"マスタデータ1","index":12,"n_rows":36,"n_cols":51,"rows_kept":36,"hidden":true,"merged":[[2,1,6,1],[2,2,2,5],[2,6,5,11],[2,12,5,14],[2,15,5,15],[2,16,5,16],[2,17,2,25],[2,26,5,26],[2,27,5,27],[2,28,5,28],[2,29,2,38],[2,39,5,39],[2,40,5,42],[2,43,3,48],[2,49,5,49],[2,50,6,50],[3,2,5,2],[3,3,5,3],[3,4,5,4],[3,5,5,5],[3,17,5,19],[3,20,3,25],[3,29,5,29],[3,30,3,32],[3,33,5,33],[3,34,5,34],[3,35,5,35],[3,36,5,36],[3,37,5,38],[4,20,5,21],[4,22,5,23],[4,24,5,25],[4,30,4,31],[4,32,5,32],[4,43,5,44],[4,45,5,46],[4,47,5,48],[21,14,25,14],[21,15,24,15],[21,16,24,16],[21,17,24,17],[21,18,24,18],[21,19,22,22],[21,23,24,27],[21,28,24,30],[21,31,24,40],[21,41,21,44],[21,45,24,45],[21,46,24,46],[21,47,24,47],[21,48,24,48],[21,49,24,49],[21,50,25,50],[22,41,24,41],[22,42,24,42],[22,43,24,43],[22,44,24,44],[23,19,24,20],[23,21,24,22]]}
[]
[null,null,"臨時　原票区分３"]
[null,"RPA\nCD","事業所",{"$nulls":3},"工事会社",{"$nulls":5},"設計書No",null,null,"カード№","原票区分",{"$nulls":9},"工事区分","訂　正","付　外","引　込　線",{"$nulls":9},"設計工量","供給\nKW\n（100W）",null,null,"引込柱No",{"$nulls":6},"RPA\nCD"]
[null,null,"支店","営業支店","営業所","グループ",{"$nulls":11},"営業所",null,null,"メッシュNo",{"$nulls":8},"灯　力","パターン",null,null,"条　数","電話防護","太　さ","口　数","線亘長"]
[{"$nulls":20},"画",null,"区",null,"図",{"$nulls":5},"方式",null,"線種",{"$nulls":10},"番",null,"の",null,"号"]
[{"$nulls":30},1]
[null,null,1,2,3,4,5,6,7,8,9,10,11,12,13,14,15,16,17,18,19,20,21,22,23,24,25,26,27,28,29,30,31,32,33,34,35,36,37,38,39,40,41,42,43,44,45,46,47,48]
[null,"A",{"$nulls":48},"A"]
{"$rows_left_out":29}
{"sheet":"マスタデータ2","index":13,"n_rows":75,"n_cols":6,"rows_kept":75,"hidden":true}
[]
[null,"VTB9438_引込線OCR用工事事業所_本番配電（VZDB）_HAIDENYY　参照"]
[null,"select * from VTB9438 order by JIGYO_CD"]
[null,"事業所CD","事業所CD上3桁","事業所CD下4桁","事業所略号1","事業所略号2"]
[null,"2101","210","0171","旭川支店　　　　","配電－１　　　　"]
[null,"2102","210","0172","旭川支店　　　　","配電－２　　　　"]
[null,"2103","210","0173","旭川支店　　　　","配電－３　　　　"]
[null,"2104","210","0174","旭川支店　　　　","配電－４　　　　"]
{"$rows_left_out":67}